{"text_format":"1","workbook":"xlsx","n_sheets":18,"sheets":["Indhold","Vandret procentuering","Lodret procentuering","Vandret procentuering (2)","Lodret procentuering (2)","Vandret Indekstal","Lodret Indekstal","Vandret Vækstrate","Lodret Vækstrate","Stikprøveusikkerhed Andel","Sammenlign 2 andele","t-test to uafhængige stikprøver","Chi2-test af krydstabel","chi_help","Chi2-simulator","Regressionsanalyse","Regressionssimulator","R-square_help"],"not_rendered":{"charts":4,"images":3,"macros":1,"external_links":3,"defined_names":74,"comments":0,"pivot_tables":0},"unopened":[],"bounds":{"document_bytes":16777216,"sheet_cells":100000,"rows_first":2000,"rows_last":500,"rows_between":2000,"halvings":0,"cell_chars":16384,"cell_head_chars":4096},"cells_cut":0,"cells_raw":0,"read":"whole","date_system":"1900"}

{"sheet":"Indhold","index":0,"n_rows":20,"n_cols":2,"rows_kept":20,"cut":false,"hidden":false,"merged":[]}
[]
[]
[null,"Den samfundsfaglige Regnemaskine"]
[]
[null,"Indhold"]
[null,"1. Vandret procentuering af krydstabel"]
[null,"2. Lodret procentuering af krydstabel"]
[null,"3. Vandret procentuering af tidsserie"]
[null,"4. Lodret procentuering af tidsserie"]
[null,"5. Vandret Indekstal på tidsserie"]
[null,"6. Lodret Indekstal på tidsserie"]
[null,"7. Vandret vækstrate"]
[null,"8. Lodret vækstrate"]
[null,"9. Stikprøveusikkerhed (andele)"]
[null,"10. Stikprøveusikkerhed (2 andele)"]
{"$rows_left_out":6}
{"sheet":"Vandret procentuering","index":1,"n_rows":45,"n_cols":19,"rows_kept":45,"cut":false,"hidden":false,"merged":[[0,18,0,21],[37,18,37,21],[4,2,4,15],[27,2,27,15],[29,0,44,0],[6,0,21,0]]}
["Vandret procentuering af krydstabel (Bruges når den uafhængige variabel er placeret i forspalten se illustration).",null,null,null,null,null,null,null,null,null,null,null,null,null,null,null,null,null,"Tilbage til hovedmenuen"]
[]
["Tabel 1: Absolutte tal"]
[]
[null,null,"Afhængig variabel"]
[null,null,"Kolonne 1","Kolonne 2","Kolonne 3","Kolonne 4","Kolonne 5","Kolonne 6","Kolonne 7","Kolonne 8","Kolonne 9","Kolonne 10","Kolonne 11","Kolonne 12","Kolonne 13","Kolonne 14","I alt"]
["Uafhængig variabel","Række 1",null,null,null,null,null,null,null,null,null,null,null,null,null,null,{"$f":"SUM(C7:P7)","v":0}]
[null,"Række 2",null,null,null,null,null,null,null,null,null,null,null,null,null,null,0]
[null,"Række 3",null,null,null,null,null,null,null,null,null,null,null,null,null,null,0]
[null,"Række 4",null,null,null,null,null,null,null,null,null,null,null,null,null,null,0]
[null,"Række 5",null,null,null,null,null,null,null,null,null,null,null,null,null,null,0]
[null,"Række 6",null,null,null,null,null,null,null,null,null,null,null,null,null,null,0]
[null,"Række 7",null,null,null,null,null,null,null,null,null,null,null,null,null,null,0]
[null,"Række 8",null,null,null,null,null,null,null,null,null,null,null,null,null,null,0]
[null,"Række 9",null,null,null,null,null,null,null,null,null,null,null,null,null,null,0]
{"$rows_left_out":31}
{"sheet":"Lodret procentuering","index":2,"n_rows":47,"n_cols":16,"rows_kept":47,"cut":false,"hidden":false,"merged":[[1,10,1,15],[5,2,5,11],[28,2,28,11],[7,0,22,0],[30,0,45,0]]}
["Lodret procentuering af krydstabel (Bruges når den uafhængige variabel er placeret i hovedspalten se illustration)."]
[null,null,null,null,null,null,null,null,null,null,"Tilbage til hovedmenuen"]
[]
["Tabel 1: Absolutte tal"]
[]
[null,null,"Uafhængig variabel"]
[null,null,"Kolonne 1","Kolonne 2","Kolonne 3","Kolonne 4","Kolonne 5","Kolonne 6","Kolonne 7","Kolonne 8","Kolonne 9","Kolonne 10","Kolonne 11","Kolonne 12","Kolonne 13","Kolonne 14"]
["Afhængig variabel","Række 1"]
[null,"Række 2"]
[null,"Række 3"]
[null,"Række 4"]
[null,"Række 5"]
[null,"Række 6"]
[null,"Række 7"]
[null,"Række 8"]
{"$rows_left_out":33}
{"sheet":"Vandret procentuering (2)","index":3,"n_rows":48,"n_cols":17,"rows_kept":48,"cut":false,"hidden":false,"merged":[[6,2,6,15],[8,0,24,0],[29,2,29,15],[31,0,47,0],[2,10,2,15]]}
["Vandret procentuering af tidsserie"]
[]
["Begyndelsesår",null,null,null,null,null,null,null,null,null,"Tilbage til hovedmenuen"]
[]
["Tabel 1: Absolutte tal"]
[]
[null,null,"Afhængig variabel"]
[null,null,"Kolonne 1","Kolonne 2","Kolonne 3","Kolonne 4","Kolonne 5","Kolonne 6","Kolonne 7","Kolonne 8","Kolonne 9","Kolonne 10","Kolonne 11","Kolonne 12","Kolonne 13","Kolonne 14","I alt"]
["Tid - Årstal",{"$f":"+$B$3","v":0},null,null,null,null,null,null,null,null,null,null,null,null,null,null,{"$f":"SUM(C9:P9)","v":0}]
[null,{"$f":"+B9+1","v":1},null,null,null,null,null,null,null,null,null,null,null,null,null,null,{"$f":"SUM(C10:P10)","v":0}]
[null,{"$f":"+B10+1","v":2},null,null,null,null,null,null,null,null,null,null,null,null,null,null,0]
[null,3,null,null,null,null,null,null,null,null,null,null,null,null,null,null,0]
[null,4,null,null,null,null,null,null,null,null,null,null,null,null,null,null,0]
[null,5,null,null,null,null,null,null,null,null,null,null,null,null,null,null,0]
[null,6,null,null,null,null,null,null,null,null,null,null,null,null,null,null,0]
{"$rows_left_out":34}
{"sheet":"Lodret procentuering (2)","index":4,"n_rows":48,"n_cols":16,"rows_kept":48,"cut":false,"hidden":false,"merged":[[8,0,23,0],[31,0,46,0],[1,9,1,14],[6,2,6,15],[29,2,29,15]]}
["Lodret procentuering af tidsserie"]
[null,null,null,null,null,null,null,null,null,"Tilbage til hovedmenuen"]
["Begyndelsesår"]
[]
["Tabel 1: Absolutte tal"]
[]
[null,null,"Tid - Årstal"]
[null,null,{"$f":"+$B$3","v":0},{"$f":"+C8+1","v":1},{"$f":"+D8+1","v":2},3,4,5,6,7,8,9,10,11,12,13]
["Afhængig variabel","Række 1"]
[null,"Række 2"]
[null,"Række 3"]
[null,"Række 4"]
[null,"Række 5"]
[null,"Række 6"]
[null,"Række 7"]
{"$rows_left_out":34}
{"sheet":"Vandret Indekstal","index":5,"n_rows":46,"n_cols":16,"rows_kept":46,"cut":false,"hidden":false,"merged":[[1,9,1,14],[7,0,22,0],[30,0,45,0],[5,2,5,15],[28,2,28,15]]}
["Vandret indekstal på tidsserie"]
[null,null,null,null,null,null,null,null,null,"Tilbage til hovedmenuen"]
["Tabel 1: Absolutte tal"]
[]
["Begyndelsesår",0]
[null,null,"Tid - År"]
[null,null,{"$f":"+$B$5","v":0},{"$f":"+C7+1","v":1},{"$f":"+D7+1","v":2},3,4,5,6,7,8,9,{"$f":"+L7+1","v":10},{"$f":"+M7+1","v":11},{"$f":"+N7+1","v":12},{"$f":"+O7+1","v":13}]
["Afhængig variabel","Række 1"]
[null,"Række 2"]
[null,"Række 3"]
[null,"Række 4"]
[null,"Række 5"]
[null,"Række 6"]
[null,"Række 7"]
[null,"Række 8"]
{"$rows_left_out":32}
{"sheet":"Lodret Indekstal","index":6,"n_rows":47,"n_cols":16,"rows_kept":47,"cut":false,"hidden":false,"merged":[[8,0,23,0],[31,0,46,0],[2,11,2,16],[6,2,6,15],[29,2,29,15]]}
["Lodret indekstal på tidsserie"]
[]
["Tabel 1: Absolutte tal",null,null,null,null,null,null,null,null,null,null,"Tilbage til hovedmenuen"]
[]
["Begyndelsesår"]
[]
[null,null,"Afhængig variabel"]
[null,null,"Kolonne 1","Kolonne 2","Kolonne 3","Kolonne 4","Kolonne 5","Kolonne 6","Kolonne 7","Kolonne 8","Kolonne 9","Kolonne 10","Kolonne 11","Kolonne 12","Kolonne 13","Kolonne 14"]
["Tid - År",{"$f":"+$B$5","v":0}]
[null,{"$f":"+B9+1","v":1}]
[null,{"$f":"+B10+1","v":2}]
[null,3]
[null,4]
[null,5]
[null,6]
{"$rows_left_out":33}
{"sheet":"Vandret Vækstrate","index":7,"n_rows":48,"n_cols":17,"rows_kept":48,"cut":false,"hidden":false,"merged":[[7,2,7,16],[9,0,24,0],[30,2,30,16],[32,0,47,0],[2,10,2,15]]}
["Vandret Vækstrate"]
[]
[null,null,null,null,null,null,null,null,null,null,"Tilbage til hovedmenuen"]
["Tabel 1: Absolutte tal"]
[]
["Begyndelsesår"]
[]
[null,null,"Tid - År"]
[null,null,{"$f":"+$B$6","v":0},{"$f":"+C9+1","v":1},{"$f":"+D9+1","v":2},3,4,5,6,7,8,9,{"$f":"+L9+1","v":10},{"$f":"+M9+1","v":11},{"$f":"+N9+1","v":12},{"$f":"+O9+1","v":13},{"$f":"+P9+1","v":14}]
["Afhængig variabel","Række 1"]
[null,"Række 2"]
[null,"Række 3"]
[null,"Række 4"]
[null,"Række 5"]
[null,"Række 6"]
{"$rows_left_out":34}
{"sheet":"Lodret Vækstrate","index":8,"n_rows":48,"n_cols":16,"rows_kept":48,"cut":false,"hidden":false,"merged":[[9,0,24,0],[32,0,47,0],[2,11,2,16],[30,2,30,15],[7,2,7,15]]}
["Lodret Vækstrate"]
[]
[null,null,null,null,null,null,null,null,null,null,null,"Tilbage til hovedmenuen"]
["Tabel 1: Absolutte tal"]
[]
["Begyndelsesår"]
[]
[null,null,"Afhængig variabel"]
[null,null,"Kolonne 1","Kolonne 2","Kolonne 3","Kolonne 4","Kolonne 5","Kolonne 6","Kolonne 7","Kolonne 8","Kolonne 9","Kolonne 10","Kolonne 11","Kolonne 12","Kolonne 13","Kolonne 14"]
["Tid - År",{"$f":"+$B$6","v":0}]
[null,{"$f":"+B10+1","v":1}]
[null,{"$f":"+B11+1","v":2}]
[null,3]
[null,4]
[null,5]
{"$rows_left_out":34}
{"sheet":"Stikprøveusikkerhed Andel","index":9,"n_rows":15,"n_cols":10,"rows_kept":15,"cut":false,"hidden":false,"merged":[[14,0,14,3]]}
["Konfidensinterval for populationsandel"]
[]
[]
[]
["Sikkerhedsniveau",0.95,"1-a","Forudsætning:"]
["Stikprøvestørrelse",1540,"n","Både np og  n(1-p) er >= 5"]
["Stikprøveandel",0.13400000000000001,"p-hat",{"$f":"IF(MIN(B12:B13)<5,\"Stikprøven er for lille :-(\",\"Stikprøven er stor nok :-)\")","v":"Stikprøven er stor nok :-)"}]
[]
[]
["Konfidensinterval",{"$f":"B7","v":0.13400000000000001},"±",{"$f":"-NORMSINV((1-$B$5)/2)*SQRT(B7*(1-B7)/B6)","v":1.7013711952663373E-2}," = ","[",{"$f":"B10-D10","v":0.11698628804733663},",",{"$f":"B10+D10","v":0.15101371195266339},"]"]
[]
[null,{"$f":"+B6*B7","v":206.36}]
[null,{"$f":"+B6*(1-B7)","v":1333.64}]
[]
["Tilbage til hovedmenuen"]
{"$rows_left_out":1}
{"sheet":"Sammenlign 2 andele","index":10,"n_rows":23,"n_cols":13,"rows_kept":23,"cut":false,"hidden":false,"merged":[[22,0,22,3],[22,4,22,5]]}
["Sammenlign to populationsandele"]
[]
[]
["Data","Stikprøve 1",null,null,"Stikprøve 2",null,"Forudsætning"]
["Stikprøvestørrelse",1609,"n1","Stikprøvestørrelse",1540,"n2","Store stikprøver"]
["#\"Success\"",{"$f":"+B5*B7","v":326.62700000000001},"x1","#\"Success\"",{"$f":"+E5*E7","v":284.89999999999998},"x2"]
["Andel",0.20300000000000001,"p-hat1","Andel",0.185,"p-hat2"]
[]
["Hypotese Test"]
[]
["Ha: p1-p2= 0",null,null,null,"2-sidet","1-sidet venstre","1-sidet højre"]
["Null Hypotese",0,"D","p-værdi",{"$f":"2*MIN(F12,G12)","v":0.20134739055479423},{"$f":"NORMSDIST(B13)","v":0.89932630472260289},{"$f":"1-F12","v":0.10067369527739711}]
["z",{"$f":"((B7-E7)-B12)/SQRT(B7*(1-B7)/B5+E7*(1-E7)/E5)","v":1.2777222118294747}]
[]
["Konfidensinterval"]
{"$rows_left_out":9}
{"sheet":"t-test to uafhængige stikprøver","index":11,"n_rows":34,"n_cols":8,"rows_kept":34,"cut":false,"hidden":false,"merged":[[1,7,1,10],[21,3,22,5],[27,3,28,5],[33,3,34,5]]}
["t-test to uafhængige stikprøver"]
[null,null,null,null,null,null,null,"Tilbage til hovedmenuen"]
["Kontrolgruppe","Forsøgsgruppe",null,null,{"$f":"+A3","v":"Kontrolgruppe"},{"$f":"+B3","v":"Forsøgsgruppe"}]
[4,7,null,"Gennemsnit",{"$f":"AVERAGE(unpooled1)","v":6.1},{"$f":"AVERAGE(unpooled2)","v":8.8000000000000007}]
[7,10,null,"Standardafvigelse",{"$f":"_xlfn.STDEV.S(unpooled1)","v":3.107338983045711},{"$f":"_xlfn.STDEV.S(unpooled2)","v":2.7808871486152285}]
[7,10,null,"Stikprøvestørrelse",{"$f":"COUNTA(unpooled1)","v":10},{"$f":"COUNTA(unpooled2)","v":10}]
[2,4]
[10,12,null,"Frihedsgrader",{"$f":"INT((E5^2/E6+F5^2/F6)^2/((E5^2/E6)^2/(E6-1)+(F5^2/F6)^2/(F6-1)))","v":17}]
[7,7,null,"Forskel i gennemsnit",{"$f":"E4-F4","v":-2.7000000000000011}]
[4,7,null,"t-teststørrelse",{"$f":"(E4-F4)/(E5^2/E6+F5^2/F6)^0.5","v":-2.0475185636205131}]
[4,7,null,"Standard fejl",{"$f":"(E5^2/E6+F5^2/F6)^0.5","v":1.3186693629901656}]
[12,12,null,"Kritisk værdi i t-fordelingen",{"$f":"_xlfn.T.INV(1-E15/2,E8)","v":2.109815577833317}]
[4,12,null,{"$f":"CONCATENATE(\"Nedre grænse \",(1-E15)*100,\"% KI\")","v":"Nedre grænse 95% KI"},{"$f":"E9-E12*E11","v":-5.4821491640481899}]
[null,null,null,{"$f":"CONCATENATE(\"Øvre grænse \",(1-E15)*100,\"% KI\")","v":"Øvre grænse 95% KI"},{"$f":"E9+E12*E11","v":8.2149164048187284E-2}]
[null,null,null,"Signifikans niveau",0.05]
{"$rows_left_out":20}
{"sheet":"Chi2-test af krydstabel","index":12,"n_rows":79,"n_cols":20,"rows_kept":79,"cut":false,"hidden":false,"merged":[[0,0,0,11],[65,0,65,10],[1,19,1,22],[3,0,3,2],[54,0,54,2],[62,0,62,2],[63,0,63,10],[57,4,57,10],[58,4,58,10],[56,4,56,10]]}
["Chi2-testværktøj"]
[null,null,null,null,null,null,null,null,null,null,null,null,null,null,null,null,null,null,null,"Tilbage til hovedmenuen"]
[]
["Observerede værdier"]
[]
[null,"C1","C2","C3","C4","C5","C6","C7","C8","C9","C10","Total"]
["R1",null,null,null,null,null,null,null,null,null,null,{"$f":"SUM(B7:K7)","v":0}]
["R2",null,null,null,null,null,null,null,null,null,null,{"$f":"SUM(B8:K8)","v":0}]
["R3",null,null,null,null,null,null,null,null,null,null,0]
["R4",null,null,null,null,null,null,null,null,null,null,0]
["R5",null,null,null,null,null,null,null,null,null,null,0]
["R6",null,null,null,null,null,null,null,null,null,null,0]
["R7",null,null,null,null,null,null,null,null,null,null,0]
["R8",null,null,null,null,null,null,null,null,null,null,0]
["R9",null,null,null,null,null,null,null,null,null,null,0]
{"$rows_left_out":65}
{"sheet":"chi_help","index":13,"n_rows":1009,"n_cols":4,"rows_kept":1009,"cut":false,"hidden":true,"merged":[]}
[]
[]
["Start",0,"Kritisk værdi",{"$f":"ROUND('Chi2-test af krydstabel'!B61,3)","v":3.8410000000000002}]
["Interval",{"$f":"MAX('Chi2-test af krydstabel'!$B$57,'Chi2-test af krydstabel'!$B$61)/800","v":4.8018235258676543E-3},"Teststørrelse",{"$f":"ROUND('Chi2-test af krydstabel'!$B$57,3)","v":0}]
[]
[]
[]
[null,"Chi2","Kritisk værdi","Teststørrelse"]
[{"$f":"+$B$3","v":0},{"$f":"_xlfn.CHISQ.DIST(A9,'Chi2-test af krydstabel'!$B$58,FALSE)","v":{"$error":"#NUM!"}},{"$f":"IF($A9<$D$3,IF($A10>$D$3,MAX($B$9:$B$1009),\"\"),\"\")","v":""},{"$f":"IF($A9<$D$4,IF($A10>$D$4,MAX($B$9:$B$1009),\"\"),\"\")","v":""}]
[{"$f":"+A9+$B$4","v":4.8018235258676543E-3},{"$f":"_xlfn.CHISQ.DIST(A10,'Chi2-test af krydstabel'!$B$58,FALSE)","v":5.7433365447517772},"",""]
[9.6036470517353086E-3,{"$f":"_xlfn.CHISQ.DIST(A11,'Chi2-test af krydstabel'!$B$58,FALSE)","v":4.0514134449454744},"",""]
[1.4405470577602962E-2,{"$f":"_xlfn.CHISQ.DIST(A12,'Chi2-test af krydstabel'!$B$58,FALSE)","v":3.3000326196549401},"",""]
[1.9207294103470617E-2,{"$f":"_xlfn.CHISQ.DIST(A13,'Chi2-test af krydstabel'!$B$58,FALSE)","v":2.8510587176571045},"",""]
[2.4009117629338272E-2,{"$f":"_xlfn.CHISQ.DIST(A14,'Chi2-test af krydstabel'!$B$58,FALSE)","v":2.5439493043873873},"",""]
[2.8810941155205928E-2,{"$f":"_xlfn.CHISQ.DIST(A15,'Chi2-test af krydstabel'!$B$58,FALSE)","v":2.3167284221552449},"",""]
{"$rows_left_out":995}
{"sheet":"Chi2-simulator","index":14,"n_rows":39,"n_cols":32,"rows_kept":39,"cut":false,"hidden":false,"merged":[[36,2,36,12],[1,2,1,3],[1,7,1,10],[38,2,38,12]]}
[]
[null,"Ønsket grad af afhængighed","Meget svag",null,null,null,null,"Tilbage til hovedmenuen",null,null,null,null,null,null,null,null,null,null,null,null,{"$f":"VLOOKUP($C$2,$AB$3:$AC$6,2,FALSE)","v":2}]
[null,null,null,null,null,null,null,null,null,null,null,null,null,null,null,null,null,null,null,null,null,null,null,null,null,null,null,"Ingen",1]
[null,"Observerede Værdier",null,null,null,null,null,null,null,null,null,null,null,null,null,null,null,null,null,null,null,1,2,3,4,null,null,"Meget svag",2]
[null,null,"Meget lav","Lav","Høj","Meget høj","I alt",null,null,null,null,null,null,null,null,null,null,null,null,null,null,{"$f":"+V4+4","v":5},{"$f":"+W4+4","v":6},7,8,null,null,"Moderat",3]
[null,"Meget lav",{"$f":"INDEX($V$11:$Y$26,MATCH(V4,$U$11:$U$26),MATCH($U$2,$V$10:$Y$10))","v":107},106,89,80,{"$f":"SUM(C6:F6)","v":382},null,null,null,null,null,null,null,null,null,null,null,null,null,null,{"$f":"+V5+4","v":9},{"$f":"+W5+4","v":10},{"$f":"+X5+4","v":11},{"$f":"+Y5+4","v":12},null,null,"Stærk",4]
[null,"Lav",107,107,105,89,{"$f":"SUM(C7:F7)","v":408},null,null,null,null,null,null,null,null,null,null,null,null,null,null,13,14,15,16]
[null,"Høj",90,105,108,107,{"$f":"SUM(C8:F8)","v":410}]
[null,"Meget høj",80,90,105,109,{"$f":"SUM(C9:F9)","v":384}]
[null,"I alt",{"$f":"SUM(C6:C9)","v":384},{"$f":"SUM(D6:D9)","v":408},{"$f":"SUM(E6:E9)","v":407},{"$f":"SUM(F6:F9)","v":385},{"$f":"SUM(C10:F10)","v":1584},null,null,null,null,null,null,null,null,null,null,null,null,null,null,1,2,3,4]
[null,null,null,null,null,null,null,null,null,null,null,null,null,null,null,null,null,null,null,null,1,{"$f":"RANDBETWEEN(108,112)","v":108},{"$f":"RANDBETWEEN(107,109)","v":107},{"$f":"RANDBETWEEN(110,112)","v":111},{"$f":"RANDBETWEEN(120,130)","v":120}]
[null,"Forventede værdier",null,null,null,null,null,null,null,null,null,null,null,null,null,null,null,null,null,null,2,{"$f":"RANDBETWEEN(103,107)","v":103},{"$f":"RANDBETWEEN(105,107)","v":106},{"$f":"RANDBETWEEN(107,109)","v":107},{"$f":"RANDBETWEEN(90,100)","v":96}]
[null,null,"Meget lav","Lav","Høj","Meget høj","I alt",null,null,null,null,null,null,null,null,null,null,null,null,null,3,{"$f":"RANDBETWEEN(98,102)","v":101},{"$f":"RANDBETWEEN(89,90)","v":89},{"$f":"RANDBETWEEN(89,90)","v":90},{"$f":"RANDBETWEEN(85,95)","v":94}]
[null,"Meget lav",{"$f":"+$G6*C$10/$G$10","v":92.606060606060609},98.393939393939391,98.152777777777771,92.847222222222229,{"$f":"SUM(C14:F14)","v":382},null,null,null,null,null,null,null,null,null,null,null,null,null,4,{"$f":"RANDBETWEEN(95,100)","v":95},{"$f":"RANDBETWEEN(80,81)","v":80},{"$f":"RANDBETWEEN(80,81)","v":81},{"$f":"RANDBETWEEN(80,90)","v":81},null,null,120,100,90,85,{"$f":"SUM(AB14:AE14)","v":395}]
[null,"Lav",98.909090909090907,105.09090909090909,104.83333333333333,99.166666666666671,{"$f":"SUM(C15:F15)","v":408},null,null,null,null,null,null,null,null,null,null,null,null,null,5,{"$f":"RANDBETWEEN(100,110)","v":104},{"$f":"RANDBETWEEN(105,107)","v":107},{"$f":"RANDBETWEEN(107,109)","v":108},{"$f":"RANDBETWEEN(90,100)","v":91},null,null,{"$f":"+AC14","v":100},{"$f":"+AB14","v":120},{"$f":"+AC14","v":100},{"$f":"+AD14","v":90},{"$f":"SUM(AB15:AE15)","v":410}]
{"$rows_left_out":25}
{"sheet":"Regressionsanalyse","index":15,"n_rows":32,"n_cols":15,"rows_kept":32,"cut":false,"hidden":false,"merged":[[1,14,1,17],[1,4,1,8]]}
["Data Labels","Data til x-akse ","Data til y-akse "]
[null,1,1,null,"Regressionsanalyse",null,null,null,null,null,null,null,null,null,"Tilbage til hovedmenuen"]
[null,2,2]
[null,3,3]
[null,4,4]
[null,5,5]
[null,6,6]
[null,6,6]
[]
[]
[]
[]
[]
[]
[]
{"$rows_left_out":18}
{"sheet":"Regressionssimulator","index":16,"n_rows":104,"n_cols":9,"rows_kept":104,"cut":false,"hidden":false,"merged":[[5,8,5,11],[0,0,0,12]]}
["R2-simulator"]
[]
[null,null,null,"Vælg den ønskede styrke ved at benytte rullefeltet i den grønne celle"]
["X","Y"]
[{"$f":"RANDBETWEEN(0,100)","v":74},{"$f":"IF($G$6=\"Ingen\", 'R-square_help'!A2,Regressionssimulator!A5*'R-square_help'!C2+'R-square_help'!B2)","v":82}]
[{"$f":"RANDBETWEEN(0,100)","v":89},{"$f":"IF($G$6=\"Ingen\", 'R-square_help'!A3,Regressionssimulator!A6*'R-square_help'!C3+'R-square_help'!B3)","v":97},null,null,null,"Styrke","Ingen",null,"Tilbage til hovedmenuen"]
[22,{"$f":"IF($G$6=\"Ingen\", 'R-square_help'!A4,Regressionssimulator!A7*'R-square_help'!C4+'R-square_help'!B4)","v":4}]
[49,{"$f":"IF($G$6=\"Ingen\", 'R-square_help'!A5,Regressionssimulator!A8*'R-square_help'!C5+'R-square_help'!B5)","v":67},null,null,null,{"$f":"\"Korrelationskoefficient = \"&ROUND(CORREL(A4:A104,B4:B104),3)","v":"Korrelationskoefficient = -0.03"}]
[33,{"$f":"IF($G$6=\"Ingen\", 'R-square_help'!A6,Regressionssimulator!A9*'R-square_help'!C6+'R-square_help'!B6)","v":73}]
[80,{"$f":"IF($G$6=\"Ingen\", 'R-square_help'!A7,Regressionssimulator!A10*'R-square_help'!C7+'R-square_help'!B7)","v":14}]
[79,{"$f":"IF($G$6=\"Ingen\", 'R-square_help'!A8,Regressionssimulator!A11*'R-square_help'!C8+'R-square_help'!B8)","v":96}]
[68,{"$f":"IF($G$6=\"Ingen\", 'R-square_help'!A9,Regressionssimulator!A12*'R-square_help'!C9+'R-square_help'!B9)","v":21}]
[30,{"$f":"IF($G$6=\"Ingen\", 'R-square_help'!A10,Regressionssimulator!A13*'R-square_help'!C10+'R-square_help'!B10)","v":45}]
[3,{"$f":"IF($G$6=\"Ingen\", 'R-square_help'!A11,Regressionssimulator!A14*'R-square_help'!C11+'R-square_help'!B11)","v":63}]
[66,{"$f":"IF($G$6=\"Ingen\", 'R-square_help'!A12,Regressionssimulator!A15*'R-square_help'!C12+'R-square_help'!B12)","v":8}]
{"$rows_left_out":90}
{"sheet":"R-square_help","index":17,"n_rows":101,"n_cols":7,"rows_kept":101,"cut":false,"hidden":true,"merged":[]}
["Random","Skæring","Hældning",null,null,"Skæring","Hældning"]
[{"$f":"RANDBETWEEN(0,100)","v":82},{"$f":"RANDBETWEEN($F$2,$F$3)","v":{"$error":"#N/A"}},{"$f":"RANDBETWEEN($G$2,$G$3)/100","v":0.93},null,null,{"$f":"VLOOKUP(Regressionssimulator!$G$6,'R-square_help'!$F$8:$G$11,2,FALSE)","v":{"$error":"#N/A"}},{"$f":"IF(Regressionssimulator!$G$6=\"Perfekt\",100,90)","v":90}]
[{"$f":"RANDBETWEEN(0,100)","v":97},{"$f":"RANDBETWEEN($F$2,$F$3)","v":{"$error":"#N/A"}},{"$f":"RANDBETWEEN($G$2,$G$3)/100","v":0.94},null,null,100,100]
[4,{"$error":"#N/A"},0.9]
[67,{"$error":"#N/A"},0.91]
[73,{"$error":"#N/A"},1]
[14,{"$error":"#N/A"},0.96,null,null,"Ingen",0]
[96,{"$error":"#N/A"},0.95,null,null,"Svag",-40]
[21,{"$error":"#N/A"},0.97,null,null,"Moderat",50]
[45,{"$error":"#N/A"},0.97,null,null,"Stærk",90]
[63,{"$error":"#N/A"},0.98,null,null,"Perfekt",100]
[8,{"$error":"#N/A"},1]
[43,{"$error":"#N/A"},0.98]
[95,{"$error":"#N/A"},0.98]
[78,{"$error":"#N/A"},1]
{"$rows_left_out":86}