{"text_format":"1","workbook":"xlsx","n_sheets":18,"sheets":["Indhold","Vandret procentuering","Lodret procentuering","Vandret procentuering (2)","Lodret procentuering (2)","Vandret Indekstal","Lodret Indekstal","Vandret Vækstrate","Lodret Vækstrate","Stikprøveusikkerhed Andel","Sammenlign 2 andele","t-test to uafhængige stikprøver","Chi2-test af krydstabel","chi_help","Chi2-simulator","Regressionsanalyse","Regressionssimulator","R-square_help"],"not_rendered":{"charts":4,"images":3,"macros":1,"external_links":3,"defined_names":74,"comments":0,"pivot_tables":0},"unopened":[],"bounds":{"document_bytes":16777216,"sheet_cells":100000,"rows_first":2000,"rows_last":500,"rows_between":2000,"halvings":0,"cell_chars":16384,"cell_head_chars":4096},"cells_cut":0,"cells_raw":0,"read":"whole","date_system":"1900"}

{"sheet":"Indhold","index":0,"n_rows":20,"n_cols":2,"rows_kept":20,"cut":false,"hidden":false,"merged":[]}
[]
[]
[null,"Den samfundsfaglige Regnemaskine"]
[]
[null,"Indhold"]
[null,"1. Vandret procentuering af krydstabel"]
[null,"2. Lodret procentuering af krydstabel"]
[null,"3. Vandret procentuering af tidsserie"]
[null,"4. Lodret procentuering af tidsserie"]
[null,"5. Vandret Indekstal på tidsserie"]
[null,"6. Lodret Indekstal på tidsserie"]
[null,"7. Vandret vækstrate"]
[null,"8. Lodret vækstrate"]
[null,"9. Stikprøveusikkerhed (andele)"]
[null,"10. Stikprøveusikkerhed (2 andele)"]
[null,"11. t-test to uafhængige stikprøver"]
[null,"12. Chi2-test af krydstabel"]
[null,"13. Chi2-simulator"]
[null,"14. Regressionsanalyse"]
[null,"15. Regressionssimulator"]

{"sheet":"Vandret procentuering","index":1,"n_rows":45,"n_cols":19,"rows_kept":45,"cut":false,"hidden":false,"merged":[[0,18,0,21],[37,18,37,21],[4,2,4,15],[27,2,27,15],[29,0,44,0],[6,0,21,0]]}
["Vandret procentuering af krydstabel (Bruges når den uafhængige variabel er placeret i forspalten se illustration).",null,null,null,null,null,null,null,null,null,null,null,null,null,null,null,null,null,"Tilbage til hovedmenuen"]
[]
["Tabel 1: Absolutte tal"]
[]
[null,null,"Afhængig variabel"]
[null,null,"Kolonne 1","Kolonne 2","Kolonne 3","Kolonne 4","Kolonne 5","Kolonne 6","Kolonne 7","Kolonne 8","Kolonne 9","Kolonne 10","Kolonne 11","Kolonne 12","Kolonne 13","Kolonne 14","I alt"]
["Uafhængig variabel","Række 1",null,null,null,null,null,null,null,null,null,null,null,null,null,null,{"$f":"SUM(C7:P7)","v":0}]
[null,"Række 2",null,null,null,null,null,null,null,null,null,null,null,null,null,null,0]
[null,"Række 3",null,null,null,null,null,null,null,null,null,null,null,null,null,null,0]
[null,"Række 4",null,null,null,null,null,null,null,null,null,null,null,null,null,null,0]
[null,"Række 5",null,null,null,null,null,null,null,null,null,null,null,null,null,null,0]
[null,"Række 6",null,null,null,null,null,null,null,null,null,null,null,null,null,null,0]
[null,"Række 7",null,null,null,null,null,null,null,null,null,null,null,null,null,null,0]
[null,"Række 8",null,null,null,null,null,null,null,null,null,null,null,null,null,null,0]
[null,"Række 9",null,null,null,null,null,null,null,null,null,null,null,null,null,null,0]
[null,"Række 10",null,null,null,null,null,null,null,null,null,null,null,null,null,null,0]
[null,"Række 11",null,null,null,null,null,null,null,null,null,null,null,null,null,null,0]
[null,"Række 12",null,null,null,null,null,null,null,null,null,null,null,null,null,null,0]
[null,"Række 13",null,null,null,null,null,null,null,null,null,null,null,null,null,null,0]
[null,"Række 14",null,null,null,null,null,null,null,null,null,null,null,null,null,null,0]
[null,"Række 15",null,null,null,null,null,null,null,null,null,null,null,null,null,null,0]
[null,"Række 16",null,null,null,null,null,null,null,null,null,null,null,null,null,null,0]
[]
[]
[]
["Tabel 2: Rækkeprocenter"]
[]
[null,null,"Afhængig variabel"]
[null,null,"Kolonne 1","Kolonne 2","Kolonne 3","Kolonne 4","Kolonne 5","Kolonne 6","Kolonne 7","Kolonne 8","Kolonne 9","Kolonne 10","Kolonne 11","Kolonne 12","Kolonne 13","Kolonne 14","I alt"]
["Uafhængig variabel","Række 1",{"$f":"IF(C7=\"\",\"\",C7/$Q7*100)","v":""},"","","","","","","","","","","","","",{"$f":"SUM(C30:P30)","v":0}]
[null,"Række 2",{"$f":"IF(C8=\"\",\"\",C8/$Q8*100)","v":""},"","","","","","","","","","","","","",{"$f":"SUM(C31:P31)","v":0}]
[null,"Række 3",{"$f":"IF(C9=\"\",\"\",C9/$Q9*100)","v":""},"","","","","","","","","","","","","",0]
[null,"Række 4",{"$f":"IF(C10=\"\",\"\",C10/$Q10*100)","v":""},"","","","","","","","","","","","","",0]
[null,"Række 5",{"$f":"IF(C11=\"\",\"\",C11/$Q11*100)","v":""},"","","","","","","","","","","","","",0]
[null,"Række 6",{"$f":"IF(C12=\"\",\"\",C12/$Q12*100)","v":""},"","","","","","","","","","","","","",0]
[null,"Række 7",{"$f":"IF(C13=\"\",\"\",C13/$Q13*100)","v":""},"","","","","","","","","","","","","",0]
[null,"Række 8",{"$f":"IF(C14=\"\",\"\",C14/$Q14*100)","v":""},"","","","","","","","","","","","","",0]
[null,"Række 9",{"$f":"IF(C15=\"\",\"\",C15/$Q15*100)","v":""},"","","","","","","","","","","","","",0]
[null,"Række 10",{"$f":"IF(C16=\"\",\"\",C16/$Q16*100)","v":""},"","","","","","","","","","","","","",0]
[null,"Række 11",{"$f":"IF(C17=\"\",\"\",C17/$Q17*100)","v":""},"","","","","","","","","","","","","",0]
[null,"Række 12",{"$f":"IF(C18=\"\",\"\",C18/$Q18*100)","v":""},"","","","","","","","","","","","","",0]
[null,"Række 13",{"$f":"IF(C19=\"\",\"\",C19/$Q19*100)","v":""},"","","","","","","","","","","","","",0]
[null,"Række 14",{"$f":"IF(C20=\"\",\"\",C20/$Q20*100)","v":""},"","","","","","","","","","","","","",0]
[null,"Række 15",{"$f":"IF(C21=\"\",\"\",C21/$Q21*100)","v":""},"","","","","","","","","","","","","",0]
[null,"Række 16",{"$f":"IF(C22=\"\",\"\",C22/$Q22*100)","v":""},"","","","","","","","","","","","","",0]

{"sheet":"Lodret procentuering","index":2,"n_rows":47,"n_cols":16,"rows_kept":47,"cut":false,"hidden":false,"merged":[[1,10,1,15],[5,2,5,11],[28,2,28,11],[7,0,22,0],[30,0,45,0]]}
["Lodret procentuering af krydstabel (Bruges når den uafhængige variabel er placeret i hovedspalten se illustration)."]
[null,null,null,null,null,null,null,null,null,null,"Tilbage til hovedmenuen"]
[]
["Tabel 1: Absolutte tal"]
[]
[null,null,"Uafhængig variabel"]
[null,null,"Kolonne 1","Kolonne 2","Kolonne 3","Kolonne 4","Kolonne 5","Kolonne 6","Kolonne 7","Kolonne 8","Kolonne 9","Kolonne 10","Kolonne 11","Kolonne 12","Kolonne 13","Kolonne 14"]
["Afhængig variabel","Række 1"]
[null,"Række 2"]
[null,"Række 3"]
[null,"Række 4"]
[null,"Række 5"]
[null,"Række 6"]
[null,"Række 7"]
[null,"Række 8"]
[null,"Række 9"]
[null,"Række 10"]
[null,"Række 11"]
[null,"Række 12"]
[null,"Række 13"]
[null,"Række 14"]
[null,"Række 15"]
[null,"Række 16"]
[null,"I alt",{"$f":"SUM(C8:C23)","v":0},0,0,0,0,0,0,{"$f":"SUM(J8:J23)","v":0},0,0,0,0,0,0]
[]
[]
["Tabel 2: Rækkeprocenter"]
[]
[null,null,"Uafhængig variabel"]
[null,null,"Kolonne 1","Kolonne 2","Kolonne 3","Kolonne 4","Kolonne 5","Kolonne 6","Kolonne 7","Kolonne 8","Kolonne 9","Kolonne 10","Kolonne 11","Kolonne 12","Kolonne 13","Kolonne 14"]
["Afhængig variabel","Række 1",{"$f":"IF(C8=\"\",\"\",C8/C$24*100)","v":""},"","","","","","",{"$f":"IF(J8=\"\",\"\",J8/J$24*100)","v":""},"","","","","",""]
[null,"Række 2","","","","","","","",{"$f":"IF(J9=\"\",\"\",J9/J$24*100)","v":""},"","","","","",""]
[null,"Række 3","","","","","","","",{"$f":"IF(J10=\"\",\"\",J10/J$24*100)","v":""},"","","","","",""]
[null,"Række 4","","","","","","","",{"$f":"IF(J11=\"\",\"\",J11/J$24*100)","v":""},"","","","","",""]
[null,"Række 5","","","","","","","",{"$f":"IF(J12=\"\",\"\",J12/J$24*100)","v":""},"","","","","",""]
[null,"Række 6","","","","","","","",{"$f":"IF(J13=\"\",\"\",J13/J$24*100)","v":""},"","","","","",""]
[null,"Række 7","","","","","","","",{"$f":"IF(J14=\"\",\"\",J14/J$24*100)","v":""},"","","","","",""]
[null,"Række 8","","","","","","","",{"$f":"IF(J15=\"\",\"\",J15/J$24*100)","v":""},"","","","","",""]
[null,"Række 9","","","","","","","",{"$f":"IF(J16=\"\",\"\",J16/J$24*100)","v":""},"","","","","",""]
[null,"Række 10","","","","","","","",{"$f":"IF(J17=\"\",\"\",J17/J$24*100)","v":""},"","","","","",""]
[null,"Række 11","","","","","","","",{"$f":"IF(J18=\"\",\"\",J18/J$24*100)","v":""},"","","","","",""]
[null,"Række 12","","","","","","","",{"$f":"IF(J19=\"\",\"\",J19/J$24*100)","v":""},"","","","","",""]
[null,"Række 13","","","","","","","",{"$f":"IF(J20=\"\",\"\",J20/J$24*100)","v":""},"","","","","",""]
[null,"Række 14",{"$f":"IF(C21=\"\",\"\",C21/C$24*100)","v":""},"","","","","","","","","","","","",""]
[null,"Række 15",{"$f":"IF(C22=\"\",\"\",C22/C$24*100)","v":""},"","","","","","","","","","","","",""]
[null,"Række 16",{"$f":"IF(C23=\"\",\"\",C23/C$24*100)","v":""},"","","","","","","","","","","","",""]
[null,"I alt",{"$f":"SUM(C31:C46)","v":0},{"$f":"SUM(D31:D46)","v":0},0,0,0,0,0,0,0,0,0,0,0,0]

{"sheet":"Vandret procentuering (2)","index":3,"n_rows":48,"n_cols":17,"rows_kept":48,"cut":false,"hidden":false,"merged":[[6,2,6,15],[8,0,24,0],[29,2,29,15],[31,0,47,0],[2,10,2,15]]}
["Vandret procentuering af tidsserie"]
[]
["Begyndelsesår",null,null,null,null,null,null,null,null,null,"Tilbage til hovedmenuen"]
[]
["Tabel 1: Absolutte tal"]
[]
[null,null,"Afhængig variabel"]
[null,null,"Kolonne 1","Kolonne 2","Kolonne 3","Kolonne 4","Kolonne 5","Kolonne 6","Kolonne 7","Kolonne 8","Kolonne 9","Kolonne 10","Kolonne 11","Kolonne 12","Kolonne 13","Kolonne 14","I alt"]
["Tid - Årstal",{"$f":"+$B$3","v":0},null,null,null,null,null,null,null,null,null,null,null,null,null,null,{"$f":"SUM(C9:P9)","v":0}]
[null,{"$f":"+B9+1","v":1},null,null,null,null,null,null,null,null,null,null,null,null,null,null,{"$f":"SUM(C10:P10)","v":0}]
[null,{"$f":"+B10+1","v":2},null,null,null,null,null,null,null,null,null,null,null,null,null,null,0]
[null,3,null,null,null,null,null,null,null,null,null,null,null,null,null,null,0]
[null,4,null,null,null,null,null,null,null,null,null,null,null,null,null,null,0]
[null,5,null,null,null,null,null,null,null,null,null,null,null,null,null,null,0]
[null,6,null,null,null,null,null,null,null,null,null,null,null,null,null,null,0]
[null,7,null,null,null,null,null,null,null,null,null,null,null,null,null,null,0]
[null,8,null,null,null,null,null,null,null,null,null,null,null,null,null,null,0]
[null,9,null,null,null,null,null,null,null,null,null,null,null,null,null,null,0]
[null,10,null,null,null,null,null,null,null,null,null,null,null,null,null,null,0]
[null,11,null,null,null,null,null,null,null,null,null,null,null,null,null,null,0]
[null,12,null,null,null,null,null,null,null,null,null,null,null,null,null,null,0]
[null,13,null,null,null,null,null,null,null,null,null,null,null,null,null,null,0]
[null,14,null,null,null,null,null,null,null,null,null,null,null,null,null,null,0]
[null,15,null,null,null,null,null,null,null,null,null,null,null,null,null,null,0]
[null,16,null,null,null,null,null,null,null,null,null,null,null,null,null,null,0]
[]
[]
["Tabel 2: Rækkeprocenter"]
[]
[null,null,"Afhængig variabel"]
[null,null,"Kolonne 1","Kolonne 2","Kolonne 3","Kolonne 4","Kolonne 5","Kolonne 6","Kolonne 7","Kolonne 8","Kolonne 9","Kolonne 10","Kolonne 11","Kolonne 12","Kolonne 13","Kolonne 14","I alt"]
["Tid - Årstal",{"$f":"+B9","v":0},{"$f":"IF(C9=\"\",\"\",C9/$Q9*100)","v":""},{"$f":"IF(D9=\"\",\"\",D9/$Q9*100)","v":""},"","","","","","","","","","","","",{"$f":"SUM(C32:P32)","v":0}]
[null,{"$f":"+B10","v":1},{"$f":"IF(C10=\"\",\"\",C10/$Q10*100)","v":""},"","","","","","","","","","","","","",{"$f":"SUM(C33:P33)","v":0}]
[null,{"$f":"+B11","v":2},{"$f":"IF(C11=\"\",\"\",C11/$Q11*100)","v":""},"","","","","","","","","","","","","",0]
[null,3,{"$f":"IF(C12=\"\",\"\",C12/$Q12*100)","v":""},"","","","","","","","","","","","","",0]
[null,4,{"$f":"IF(C13=\"\",\"\",C13/$Q13*100)","v":""},"","","","","","","","","","","","","",0]
[null,5,{"$f":"IF(C14=\"\",\"\",C14/$Q14*100)","v":""},"","","","","","","","","","","","","",0]
[null,6,{"$f":"IF(C15=\"\",\"\",C15/$Q15*100)","v":""},"","","","","","","","","","","","","",0]
[null,7,{"$f":"IF(C16=\"\",\"\",C16/$Q16*100)","v":""},"","","","","","","","","","","","","",0]
[null,8,{"$f":"IF(C17=\"\",\"\",C17/$Q17*100)","v":""},"","","","","","","","","","","","","",0]
[null,9,{"$f":"IF(C18=\"\",\"\",C18/$Q18*100)","v":""},"","","","","","","","","","","","","",0]
[null,10,{"$f":"IF(C19=\"\",\"\",C19/$Q19*100)","v":""},"","","","","","","","","","","","","",0]
[null,11,{"$f":"IF(C20=\"\",\"\",C20/$Q20*100)","v":""},"","","","","","","","","","","","","",0]
[null,12,{"$f":"IF(C21=\"\",\"\",C21/$Q21*100)","v":""},"","","","","","","","","","","","","",0]
[null,13,{"$f":"IF(C22=\"\",\"\",C22/$Q22*100)","v":""},"","","","","","","","","","","","","",0]
[null,14,{"$f":"IF(C23=\"\",\"\",C23/$Q23*100)","v":""},"","","","","","","","","","","","","",0]
[null,15,{"$f":"IF(C24=\"\",\"\",C24/$Q24*100)","v":""},"","","","","","","","","","","","","",0]
[null,16,{"$f":"IF(C25=\"\",\"\",C25/$Q25*100)","v":""},"","","","","","","","","","","","","",0]

{"sheet":"Lodret procentuering (2)","index":4,"n_rows":48,"n_cols":16,"rows_kept":48,"cut":false,"hidden":false,"merged":[[8,0,23,0],[31,0,46,0],[1,9,1,14],[6,2,6,15],[29,2,29,15]]}
["Lodret procentuering af tidsserie"]
[null,null,null,null,null,null,null,null,null,"Tilbage til hovedmenuen"]
["Begyndelsesår"]
[]
["Tabel 1: Absolutte tal"]
[]
[null,null,"Tid - Årstal"]
[null,null,{"$f":"+$B$3","v":0},{"$f":"+C8+1","v":1},{"$f":"+D8+1","v":2},3,4,5,6,7,8,9,10,11,12,13]
["Afhængig variabel","Række 1"]
[null,"Række 2"]
[null,"Række 3"]
[null,"Række 4"]
[null,"Række 5"]
[null,"Række 6"]
[null,"Række 7"]
[null,"Række 8"]
[null,"Række 9"]
[null,"Række 10"]
[null,"Række 11"]
[null,"Række 12"]
[null,"Række 13"]
[null,"Række 14"]
[null,"Række 15"]
[null,"Række 16"]
[null,"I alt",{"$f":"SUM(C9:C24)","v":0},{"$f":"SUM(D9:D24)","v":0},0,0,0,0,0,0,0,0,0,0,0,0]
[]
[]
["Tabel 2: Kolonneprocenter"]
[]
[null,null,"Tid - Årstal"]
[null,null,{"$f":"+C8","v":0},1,2,3,4,5,6,7,8,9,10,11,12,13]
["Afhængig variabel","Række 1",{"$f":"IF(C9=\"\",\"\",C9/C$25*100)","v":""},{"$f":"IF(D9=\"\",\"\",D9/D$25*100)","v":""},"","","","","","","","","","","",""]
[null,"Række 2",{"$f":"IF(C10=\"\",\"\",C10/C$25*100)","v":""},"","","","","","","","","","","","",""]
[null,"Række 3",{"$f":"IF(C11=\"\",\"\",C11/C$25*100)","v":""},"","","","","","","","","","","","",""]
[null,"Række 4",{"$f":"IF(C12=\"\",\"\",C12/C$25*100)","v":""},"","","","","","","","","","","","",""]
[null,"Række 5",{"$f":"IF(C13=\"\",\"\",C13/C$25*100)","v":""},"","","","","","","","","","","","",""]
[null,"Række 6",{"$f":"IF(C14=\"\",\"\",C14/C$25*100)","v":""},"","","","","","","","","","","","",""]
[null,"Række 7",{"$f":"IF(C15=\"\",\"\",C15/C$25*100)","v":""},"","","","","","","","","","","","",""]
[null,"Række 8",{"$f":"IF(C16=\"\",\"\",C16/C$25*100)","v":""},"","","","","","","","","","","","",""]
[null,"Række 9",{"$f":"IF(C17=\"\",\"\",C17/C$25*100)","v":""},"","","","","","","","","","","","",""]
[null,"Række 10",{"$f":"IF(C18=\"\",\"\",C18/C$25*100)","v":""},"","","","","","","","","","","","",""]
[null,"Række 11",{"$f":"IF(C19=\"\",\"\",C19/C$25*100)","v":""},"","","","","","","","","","","","",""]
[null,"Række 12",{"$f":"IF(C20=\"\",\"\",C20/C$25*100)","v":""},"","","","","","","","","","","","",""]
[null,"Række 13",{"$f":"IF(C21=\"\",\"\",C21/C$25*100)","v":""},"","","","","","","","","","","","",""]
[null,"Række 14",{"$f":"IF(C22=\"\",\"\",C22/C$25*100)","v":""},"","","","","","","","","","","","",""]
[null,"Række 15",{"$f":"IF(C23=\"\",\"\",C23/C$25*100)","v":""},"","","","","","","","","","","","",""]
[null,"Række 16",{"$f":"IF(C24=\"\",\"\",C24/C$25*100)","v":""},"","","","","","","","","","","","",""]
[null,"I alt",{"$f":"SUM(C32:C47)","v":0},{"$f":"SUM(D32:D47)","v":0},0,0,0,0,0,0,0,0,0,0,0,0]

{"sheet":"Vandret Indekstal","index":5,"n_rows":46,"n_cols":16,"rows_kept":46,"cut":false,"hidden":false,"merged":[[1,9,1,14],[7,0,22,0],[30,0,45,0],[5,2,5,15],[28,2,28,15]]}
["Vandret indekstal på tidsserie"]
[null,null,null,null,null,null,null,null,null,"Tilbage til hovedmenuen"]
["Tabel 1: Absolutte tal"]
[]
["Begyndelsesår",0]
[null,null,"Tid - År"]
[null,null,{"$f":"+$B$5","v":0},{"$f":"+C7+1","v":1},{"$f":"+D7+1","v":2},3,4,5,6,7,8,9,{"$f":"+L7+1","v":10},{"$f":"+M7+1","v":11},{"$f":"+N7+1","v":12},{"$f":"+O7+1","v":13}]
["Afhængig variabel","Række 1"]
[null,"Række 2"]
[null,"Række 3"]
[null,"Række 4"]
[null,"Række 5"]
[null,"Række 6"]
[null,"Række 7"]
[null,"Række 8"]
[null,"Række 9"]
[null,"Række 10"]
[null,"Række 11"]
[null,"Række 12"]
[null,"Række 13"]
[null,"Række 14"]
[null,"Række 15"]
[null,"Række 16"]
[]
[]
[]
["Tabel 2: Indekstal (År 0=100)"]
[]
[null,null,"Tid - År"]
[null,null,{"$f":"+C7","v":0},{"$f":"+D7","v":1},2,3,4,5,6,7,8,9,10,11,12,13]
["Afhængig variabel","Række 1",{"$f":"IF(C8=\"\",\"\",C8/$C8*100)","v":""},{"$f":"IF(D8=\"\",\"\",D8/$C8*100)","v":""},"","","","","","","","","","","",""]
[null,"Række 2",{"$f":"IF(C9=\"\",\"\",C9/$C9*100)","v":""},"","","","","","","","","","","","",""]
[null,"Række 3",{"$f":"IF(C10=\"\",\"\",C10/$C10*100)","v":""},"","","","","","","","","","","","",""]
[null,"Række 4",{"$f":"IF(C11=\"\",\"\",C11/$C11*100)","v":""},"","","","","","","","","","","","",""]
[null,"Række 5",{"$f":"IF(C12=\"\",\"\",C12/$C12*100)","v":""},"","","","","","","","","","","","",""]
[null,"Række 6",{"$f":"IF(C13=\"\",\"\",C13/$C13*100)","v":""},"","","","","","","","","","","","",""]
[null,"Række 7",{"$f":"IF(C14=\"\",\"\",C14/$C14*100)","v":""},"","","","","","","","","","","","",""]
[null,"Række 8",{"$f":"IF(C15=\"\",\"\",C15/$C15*100)","v":""},"","","","","","","","","","","","",""]
[null,"Række 9",{"$f":"IF(C16=\"\",\"\",C16/$C16*100)","v":""},"","","","","","","","","","","","",""]
[null,"Række 10",{"$f":"IF(C17=\"\",\"\",C17/$C17*100)","v":""},"","","","","","","","","","","","",""]
[null,"Række 11",{"$f":"IF(C18=\"\",\"\",C18/$C18*100)","v":""},"","","","","","","","","","","","",""]
[null,"Række 12",{"$f":"IF(C19=\"\",\"\",C19/$C19*100)","v":""},"","","","","","","","","","","","",""]
[null,"Række 13",{"$f":"IF(C20=\"\",\"\",C20/$C20*100)","v":""},"","","","","","","","","","","","",""]
[null,"Række 14",{"$f":"IF(C21=\"\",\"\",C21/$C21*100)","v":""},"","","","","","","","","","","","",""]
[null,"Række 15",{"$f":"IF(C22=\"\",\"\",C22/$C22*100)","v":""},"","","","","","","","","","","","",""]
[null,"Række 16",{"$f":"IF(C23=\"\",\"\",C23/$C23*100)","v":""},"","","","","","","","","","","","",""]

{"sheet":"Lodret Indekstal","index":6,"n_rows":47,"n_cols":16,"rows_kept":47,"cut":false,"hidden":false,"merged":[[8,0,23,0],[31,0,46,0],[2,11,2,16],[6,2,6,15],[29,2,29,15]]}
["Lodret indekstal på tidsserie"]
[]
["Tabel 1: Absolutte tal",null,null,null,null,null,null,null,null,null,null,"Tilbage til hovedmenuen"]
[]
["Begyndelsesår"]
[]
[null,null,"Afhængig variabel"]
[null,null,"Kolonne 1","Kolonne 2","Kolonne 3","Kolonne 4","Kolonne 5","Kolonne 6","Kolonne 7","Kolonne 8","Kolonne 9","Kolonne 10","Kolonne 11","Kolonne 12","Kolonne 13","Kolonne 14"]
["Tid - År",{"$f":"+$B$5","v":0}]
[null,{"$f":"+B9+1","v":1}]
[null,{"$f":"+B10+1","v":2}]
[null,3]
[null,4]
[null,5]
[null,6]
[null,7]
[null,8]
[null,9]
[null,10]
[null,11]
[null,12]
[null,13]
[null,14]
[null,15]
[]
[]
[]
["Tabel 2: Indekstal (År 1=100)"]
[]
[null,null,"Afhængig variabel"]
[null,null,"Kolonne 1","Kolonne 2","Kolonne 3","Kolonne 4","Kolonne 5","Kolonne 6","Kolonne 7","Kolonne 8","Kolonne 9","Kolonne 10","Kolonne 11","Kolonne 12","Kolonne 13","Kolonne 14"]
["Tid - År",{"$f":"+B9","v":0},{"$f":"IF(C9=\"\",\"\",C9/C$9*100)","v":""},{"$f":"IF(D9=\"\",\"\",D9/D$9*100)","v":""},"","","","","","","","","","","",""]
[null,1,{"$f":"IF(C10=\"\",\"\",C10/C$9*100)","v":""},"","","","","","","","","","","","",""]
[null,2,{"$f":"IF(C11=\"\",\"\",C11/C$9*100)","v":""},"","","","","","","","","","","","",""]
[null,3,{"$f":"IF(C12=\"\",\"\",C12/C$9*100)","v":""},"","","","","","","","","","","","",""]
[null,4,{"$f":"IF(C13=\"\",\"\",C13/C$9*100)","v":""},"","","","","","","","","","","","",""]
[null,5,{"$f":"IF(C14=\"\",\"\",C14/C$9*100)","v":""},"","","","","","","","","","","","",""]
[null,6,{"$f":"IF(C15=\"\",\"\",C15/C$9*100)","v":""},"","","","","","","","","","","","",""]
[null,7,{"$f":"IF(C16=\"\",\"\",C16/C$9*100)","v":""},"","","","","","","","","","","","",""]
[null,8,{"$f":"IF(C17=\"\",\"\",C17/C$9*100)","v":""},"","","","","","","","","","","","",""]
[null,9,{"$f":"IF(C18=\"\",\"\",C18/C$9*100)","v":""},"","","","","","","","","","","","",""]
[null,10,{"$f":"IF(C19=\"\",\"\",C19/C$9*100)","v":""},"","","","","","","","","","","","",""]
[null,11,{"$f":"IF(C20=\"\",\"\",C20/C$9*100)","v":""},"","","","","","","","","","","","",""]
[null,12,{"$f":"IF(C21=\"\",\"\",C21/C$9*100)","v":""},"","","","","","","","","","","","",""]
[null,13,{"$f":"IF(C22=\"\",\"\",C22/C$9*100)","v":""},"","","","","","","","","","","","",""]
[null,14,{"$f":"IF(C23=\"\",\"\",C23/C$9*100)","v":""},"","","","","","","","","","","","",""]
[null,15,{"$f":"IF(C24=\"\",\"\",C24/C$9*100)","v":""},"","","","","","","","","","","","",""]

{"sheet":"Vandret Vækstrate","index":7,"n_rows":48,"n_cols":17,"rows_kept":48,"cut":false,"hidden":false,"merged":[[7,2,7,16],[9,0,24,0],[30,2,30,16],[32,0,47,0],[2,10,2,15]]}
["Vandret Vækstrate"]
[]
[null,null,null,null,null,null,null,null,null,null,"Tilbage til hovedmenuen"]
["Tabel 1: Absolutte tal"]
[]
["Begyndelsesår"]
[]
[null,null,"Tid - År"]
[null,null,{"$f":"+$B$6","v":0},{"$f":"+C9+1","v":1},{"$f":"+D9+1","v":2},3,4,5,6,7,8,9,{"$f":"+L9+1","v":10},{"$f":"+M9+1","v":11},{"$f":"+N9+1","v":12},{"$f":"+O9+1","v":13},{"$f":"+P9+1","v":14}]
["Afhængig variabel","Række 1"]
[null,"Række 2"]
[null,"Række 3"]
[null,"Række 4"]
[null,"Række 5"]
[null,"Række 6"]
[null,"Række 7"]
[null,"Række 8"]
[null,"Række 9"]
[null,"Række 10"]
[null,"Række 11"]
[null,"Række 12"]
[null,"Række 13"]
[null,"Række 14"]
[null,"Række 15"]
[null,"Række 16"]
[]
[]
[]
["Tabel 2: Årlig procentvis vækstrate"]
[]
[null,null,"Tid - År"]
[null,null,{"$f":"+C9","v":0},{"$f":"+D9","v":1},2,3,4,5,6,7,8,9,10,11,12,13,14]
["Afhængig variabel","Række 1","--",{"$f":"IF(D10=\"\",\"\",((D10-C10)/C10)*100)","v":""},{"$f":"IF(E10=\"\",\"\",((E10-D10)/D10)*100)","v":""},"","","","","","","","","","","",""]
[null,"Række 2","--",{"$f":"IF(D11=\"\",\"\",((D11-C11)/C11)*100)","v":""},"","","","","","","","","","","","",""]
[null,"Række 3","--","","","","","","","","","","","","","",""]
[null,"Række 4","--","","","","","","","","","","","","","",""]
[null,"Række 5","--","","","","","","","","","","","","","",""]
[null,"Række 6","--","","","","","","","","","","","","","",""]
[null,"Række 7","--","","","","","","","","","","","","","",""]
[null,"Række 8","--","","","","","","","","","","","","","",""]
[null,"Række 9","--","","","","","","","","","","","","","",""]
[null,"Række 10","--","","","","","","","","","","","","","",""]
[null,"Række 11","--","","","","","","","","","","","","","",""]
[null,"Række 12","--","","","","","","","","","","","","","",""]
[null,"Række 13","--","","","","","","","","","","","","","",""]
[null,"Række 14","--","","","","","","","","","","","","","",""]
[null,"Række 15","--","","","","","","","","","","","","","",""]
[null,"Række 16","--","","","","","","","","","","","","","",""]

{"sheet":"Lodret Vækstrate","index":8,"n_rows":48,"n_cols":16,"rows_kept":48,"cut":false,"hidden":false,"merged":[[9,0,24,0],[32,0,47,0],[2,11,2,16],[30,2,30,15],[7,2,7,15]]}
["Lodret Vækstrate"]
[]
[null,null,null,null,null,null,null,null,null,null,null,"Tilbage til hovedmenuen"]
["Tabel 1: Absolutte tal"]
[]
["Begyndelsesår"]
[]
[null,null,"Afhængig variabel"]
[null,null,"Kolonne 1","Kolonne 2","Kolonne 3","Kolonne 4","Kolonne 5","Kolonne 6","Kolonne 7","Kolonne 8","Kolonne 9","Kolonne 10","Kolonne 11","Kolonne 12","Kolonne 13","Kolonne 14"]
["Tid - År",{"$f":"+$B$6","v":0}]
[null,{"$f":"+B10+1","v":1}]
[null,{"$f":"+B11+1","v":2}]
[null,3]
[null,4]
[null,5]
[null,6]
[null,7]
[null,8]
[null,9]
[null,10]
[null,11]
[null,12]
[null,13]
[null,14]
[null,15]
[]
[]
[]
["Tabel 2: Årlig procentvis vækstrate"]
[]
[null,null,"Afhængig variabel"]
[null,null,"Kolonne 1","Kolonne 2","Kolonne 3","Kolonne 4","Kolonne 5","Kolonne 6","Kolonne 7","Kolonne 8","Kolonne 9","Kolonne 10","Kolonne 11","Kolonne 12","Kolonne 13","Kolonne 14"]
["Tid - År",{"$f":"+B10","v":0},"-- ","-- ","-- ","-- ","-- ","-- ","-- ","-- ","-- ","-- ","-- ","-- ","-- ","-- "]
[null,1,{"$f":"IF(C11=\"\",\"\",((C11-C10)/C10)*100)","v":""},{"$f":"IF(D11=\"\",\"\",((D11-D10)/D10)*100)","v":""},"","","","","","","","","","","",""]
[null,2,{"$f":"IF(C12=\"\",\"\",((C12-C11)/C11)*100)","v":""},"","","","","","","","","","","","",""]
[null,3,{"$f":"IF(C13=\"\",\"\",((C13-C12)/C12)*100)","v":""},"","","","","","","","","","","","",""]
[null,4,{"$f":"IF(C14=\"\",\"\",((C14-C13)/C13)*100)","v":""},"","","","","","","","","","","","",""]
[null,5,{"$f":"IF(C15=\"\",\"\",((C15-C14)/C14)*100)","v":""},"","","","","","","","","","","","",""]
[null,6,{"$f":"IF(C16=\"\",\"\",((C16-C15)/C15)*100)","v":""},"","","","","","","","","","","","",""]
[null,7,{"$f":"IF(C17=\"\",\"\",((C17-C16)/C16)*100)","v":""},"","","","","","","","","","","","",""]
[null,8,{"$f":"IF(C18=\"\",\"\",((C18-C17)/C17)*100)","v":""},"","","","","","","","","","","","",""]
[null,9,{"$f":"IF(C19=\"\",\"\",((C19-C18)/C18)*100)","v":""},"","","","","","","","","","","","",""]
[null,{"$f":"+B20","v":10},{"$f":"IF(C20=\"\",\"\",((C20-C19)/C19)*100)","v":""},"","","","","","","","","","","","",""]
[null,11,{"$f":"IF(C21=\"\",\"\",((C21-C20)/C20)*100)","v":""},"","","","","","","","","","","","",""]
[null,12,{"$f":"IF(C22=\"\",\"\",((C22-C21)/C21)*100)","v":""},"","","","","","","","","","","","",""]
[null,13,{"$f":"IF(C23=\"\",\"\",((C23-C22)/C22)*100)","v":""},"","","","","","","","","","","","",""]
[null,14,{"$f":"IF(C24=\"\",\"\",((C24-C23)/C23)*100)","v":""},"","","","","","","","","","","","",""]
[null,15,{"$f":"IF(C25=\"\",\"\",((C25-C24)/C24)*100)","v":""},"","","","","","","","","","","","",""]

{"sheet":"Stikprøveusikkerhed Andel","index":9,"n_rows":15,"n_cols":10,"rows_kept":15,"cut":false,"hidden":false,"merged":[[14,0,14,3]]}
["Konfidensinterval for populationsandel"]
[]
[]
[]
["Sikkerhedsniveau",0.95,"1-a","Forudsætning:"]
["Stikprøvestørrelse",1540,"n","Både np og  n(1-p) er >= 5"]
["Stikprøveandel",0.13400000000000001,"p-hat",{"$f":"IF(MIN(B12:B13)<5,\"Stikprøven er for lille :-(\",\"Stikprøven er stor nok :-)\")","v":"Stikprøven er stor nok :-)"}]
[]
[]
["Konfidensinterval",{"$f":"B7","v":0.13400000000000001},"±",{"$f":"-NORMSINV((1-$B$5)/2)*SQRT(B7*(1-B7)/B6)","v":1.7013711952663373E-2}," = ","[",{"$f":"B10-D10","v":0.11698628804733663},",",{"$f":"B10+D10","v":0.15101371195266339},"]"]
[]
[null,{"$f":"+B6*B7","v":206.36}]
[null,{"$f":"+B6*(1-B7)","v":1333.64}]
[]
["Tilbage til hovedmenuen"]

{"sheet":"Sammenlign 2 andele","index":10,"n_rows":23,"n_cols":13,"rows_kept":23,"cut":false,"hidden":false,"merged":[[22,0,22,3],[22,4,22,5]]}
["Sammenlign to populationsandele"]
[]
[]
["Data","Stikprøve 1",null,null,"Stikprøve 2",null,"Forudsætning"]
["Stikprøvestørrelse",1609,"n1","Stikprøvestørrelse",1540,"n2","Store stikprøver"]
["#\"Success\"",{"$f":"+B5*B7","v":326.62700000000001},"x1","#\"Success\"",{"$f":"+E5*E7","v":284.89999999999998},"x2"]
["Andel",0.20300000000000001,"p-hat1","Andel",0.185,"p-hat2"]
[]
["Hypotese Test"]
[]
["Ha: p1-p2= 0",null,null,null,"2-sidet","1-sidet venstre","1-sidet højre"]
["Null Hypotese",0,"D","p-værdi",{"$f":"2*MIN(F12,G12)","v":0.20134739055479423},{"$f":"NORMSDIST(B13)","v":0.89932630472260289},{"$f":"1-F12","v":0.10067369527739711}]
["z",{"$f":"((B7-E7)-B12)/SQRT(B7*(1-B7)/B5+E7*(1-E7)/E5)","v":1.2777222118294747}]
[]
["Konfidensinterval"]
[null,null,null,null,"Konfidensinterval på forskellen mellem to andele"]
["Sikkerhedsniveau",0.95,"1 - a",null,{"$f":"B7-E7","v":1.8000000000000016E-2},"±",{"$f":"-NORMSINV((1-B17)/2)*SQRT(B7*(1-B7)/B5+E7*(1-E7)/E5)","v":2.7611128142796496E-2},"=","[",{"$f":"E17-G17","v":-9.6111281427964795E-3},",",{"$f":"E17+G17","v":4.5611128142796512E-2},"]"]
[]
[]
[]
[]
[]
["Tilbage til hovedmenuen"]

{"sheet":"t-test to uafhængige stikprøver","index":11,"n_rows":34,"n_cols":8,"rows_kept":34,"cut":false,"hidden":false,"merged":[[1,7,1,10],[21,3,22,5],[27,3,28,5],[33,3,34,5]]}
["t-test to uafhængige stikprøver"]
[null,null,null,null,null,null,null,"Tilbage til hovedmenuen"]
["Kontrolgruppe","Forsøgsgruppe",null,null,{"$f":"+A3","v":"Kontrolgruppe"},{"$f":"+B3","v":"Forsøgsgruppe"}]
[4,7,null,"Gennemsnit",{"$f":"AVERAGE(unpooled1)","v":6.1},{"$f":"AVERAGE(unpooled2)","v":8.8000000000000007}]
[7,10,null,"Standardafvigelse",{"$f":"_xlfn.STDEV.S(unpooled1)","v":3.107338983045711},{"$f":"_xlfn.STDEV.S(unpooled2)","v":2.7808871486152285}]
[7,10,null,"Stikprøvestørrelse",{"$f":"COUNTA(unpooled1)","v":10},{"$f":"COUNTA(unpooled2)","v":10}]
[2,4]
[10,12,null,"Frihedsgrader",{"$f":"INT((E5^2/E6+F5^2/F6)^2/((E5^2/E6)^2/(E6-1)+(F5^2/F6)^2/(F6-1)))","v":17}]
[7,7,null,"Forskel i gennemsnit",{"$f":"E4-F4","v":-2.7000000000000011}]
[4,7,null,"t-teststørrelse",{"$f":"(E4-F4)/(E5^2/E6+F5^2/F6)^0.5","v":-2.0475185636205131}]
[4,7,null,"Standard fejl",{"$f":"(E5^2/E6+F5^2/F6)^0.5","v":1.3186693629901656}]
[12,12,null,"Kritisk værdi i t-fordelingen",{"$f":"_xlfn.T.INV(1-E15/2,E8)","v":2.109815577833317}]
[4,12,null,{"$f":"CONCATENATE(\"Nedre grænse \",(1-E15)*100,\"% KI\")","v":"Nedre grænse 95% KI"},{"$f":"E9-E12*E11","v":-5.4821491640481899}]
[null,null,null,{"$f":"CONCATENATE(\"Øvre grænse \",(1-E15)*100,\"% KI\")","v":"Øvre grænse 95% KI"},{"$f":"E9+E12*E11","v":8.2149164048187284E-2}]
[null,null,null,"Signifikans niveau",0.05]
[]
[]
[null,null,null,"To-sidet alternativ hypotese"]
[null,null,null,"p-værdi",{"$f":"MIN(E25,E31)*2","v":5.6382688794435955E-2}]
[null,null,null,"H0","μ1 -μ2 = 0"]
[null,null,null,"HA:","μ1 -μ2 ≠ 0"]
[null,null,null,{"$f":"IF(E19<E15,CONCATENATE(\"Da p værdien/signifikanssandsynligheden \",ROUND(E19,4),\" < \",E15, \" signifikansniveauet, afviser vi nulhypotesen\"),CONCATENATE(\"Da p værdien/signifikanssandsynligheden \",ROUND(E19,4),\" > \",E15,\" signifikansniveauet, kan vi ikke afvise nulhypotesen.\"))","v":"Da p værdien/signifikanssandsynligheden 0.0564 > 0.05 signifikansniveauet, kan vi ikke afvise nulhypotesen."}]
[]
[null,null,null,"Et-sidet alternativ hypotese"]
[null,null,null,"p-værdi",{"$f":"1-E31","v":0.97180865560278207}]
[null,null,null,"H0","μ1 -μ2 ≤ 0"]
[null,null,null,"HA:","μ1 -μ2 > 0"]
[null,null,null,{"$f":"IF(E25<E15,CONCATENATE(\"Da p værdien/signifikanssandsynligheden \",ROUND(E25,4),\" < \",E15, \" signifikansniveauet, afviser vi nulhypotesen\"),CONCATENATE(\"Da p værdien/signifikanssandsynligheden \",ROUND(E25,4),\" > \",E15,\" signifikansniveauet, kan vi ikke afvise nulhypotesen.\"))","v":"Da p værdien/signifikanssandsynligheden 0.9718 > 0.05 signifikansniveauet, kan vi ikke afvise nulhypotesen."}]
[]
[null,null,null,"Et-sidet alternativ hypotese"]
[null,null,null,"p-værdi",{"$f":"_xlfn.T.DIST(E10,E8,1)","v":2.8191344397217977E-2}]
[null,null,null,"H0","μ1 -μ2 ≥ 0"]
[null,null,null,"HA:","μ1 -μ2 < 0"]
[null,null,null,{"$f":"IF(E31<E15,CONCATENATE(\"Da p værdien/signifikanssandsynligheden \",ROUND(E31,4),\" < \",E15, \" signifikansniveauet, afviser vi nulhypotesen\"),CONCATENATE(\"Da p værdien/signifikanssandsynligheden \",ROUND(E31,4),\" > \",E15,\" signifikansniveauet, kan vi ikke afvise nulhypotesen.\"))","v":"Da p værdien/signifikanssandsynligheden 0.0282 < 0.05 signifikansniveauet, afviser vi nulhypotesen"}]

{"sheet":"Chi2-test af krydstabel","index":12,"n_rows":79,"n_cols":20,"rows_kept":79,"cut":false,"hidden":false,"merged":[[0,0,0,11],[65,0,65,10],[1,19,1,22],[3,0,3,2],[54,0,54,2],[62,0,62,2],[63,0,63,10],[57,4,57,10],[58,4,58,10],[56,4,56,10]]}
["Chi2-testværktøj"]
[null,null,null,null,null,null,null,null,null,null,null,null,null,null,null,null,null,null,null,"Tilbage til hovedmenuen"]
[]
["Observerede værdier"]
[]
[null,"C1","C2","C3","C4","C5","C6","C7","C8","C9","C10","Total"]
["R1",null,null,null,null,null,null,null,null,null,null,{"$f":"SUM(B7:K7)","v":0}]
["R2",null,null,null,null,null,null,null,null,null,null,{"$f":"SUM(B8:K8)","v":0}]
["R3",null,null,null,null,null,null,null,null,null,null,0]
["R4",null,null,null,null,null,null,null,null,null,null,0]
["R5",null,null,null,null,null,null,null,null,null,null,0]
["R6",null,null,null,null,null,null,null,null,null,null,0]
["R7",null,null,null,null,null,null,null,null,null,null,0]
["R8",null,null,null,null,null,null,null,null,null,null,0]
["R9",null,null,null,null,null,null,null,null,null,null,0]
["R10",null,null,null,null,null,null,null,null,null,null,0]
["R11",null,null,null,null,null,null,null,null,null,null,0]
["R12",null,null,null,null,null,null,null,null,null,null,0]
["Total",{"$f":"SUM(B7:B18)","v":0},{"$f":"SUM(C7:C18)","v":0},0,0,0,0,0,0,0,0,0]
[]
["Forventede værdier (Lyserøde celler viser, at der er for få forventede værdier. Der skal være mindst fem)"]
[]
[null,"C1","C2","C3","C4","C5","C6","C7","C8","C9","C10","Total"]
["R1",{"$f":"IF(B7=\"\",\"\",+$L7*B$19/$L$19)","v":""},{"$f":"IF(C7=\"\",\"\",+$L7*C$19/$L$19)","v":""},"","","","","","","","",{"$f":"SUM(B24:K24)","v":0}]
["R2",{"$f":"IF(B8=\"\",\"\",+$L8*B$19/$L$19)","v":""},"","","","","","","","","",0]
["R3",{"$f":"IF(B9=\"\",\"\",+$L9*B$19/$L$19)","v":""},"","","","","","","","","",0]
["R4",{"$f":"IF(B10=\"\",\"\",+$L10*B$19/$L$19)","v":""},"","","","","","","","","",0]
["R5",{"$f":"IF(B11=\"\",\"\",+$L11*B$19/$L$19)","v":""},"","","","","","","","","",0]
["R6",{"$f":"IF(B12=\"\",\"\",+$L12*B$19/$L$19)","v":""},"","","","","","","","","",0]
["R7",{"$f":"IF(B13=\"\",\"\",+$L13*B$19/$L$19)","v":""},"","","","","","","","","",0]
["R8",{"$f":"IF(B14=\"\",\"\",+$L14*B$19/$L$19)","v":""},"","","","","","","","","",0]
["R9",{"$f":"IF(B15=\"\",\"\",+$L15*B$19/$L$19)","v":""},"","","","","","","","","",0]
["R10",{"$f":"IF(B16=\"\",\"\",+$L16*B$19/$L$19)","v":""},"","","","","","","","","",0]
["R11",{"$f":"IF(B17=\"\",\"\",+$L17*B$19/$L$19)","v":""},"","","","","","","","","",0]
["R12",{"$f":"IF(B18=\"\",\"\",+$L18*B$19/$L$19)","v":""},"","","","","","","","","",0]
["Total",{"$f":"SUM(B24:B35)","v":0},{"$f":"SUM(C24:C35)","v":0},0,0,0,0,0,0,0,0,0]
[]
["Chi2-beregning (Røde celler bidrager særlig meget til Chi2 - grønne mindst)"]
[]
[null,"C1","C2","C3","C4","C5","C6","C7","C8","C9","C10","Total"]
["R1",{"$f":"IF(B7=\"\",\"\",(B7-B24)^2/B24)","v":""},{"$f":"IF(C7=\"\",\"\",(C7-C24)^2/C24)","v":""},"","","","","","","","",{"$f":"SUM(B41:K41)","v":0}]
["R2",{"$f":"IF(B8=\"\",\"\",(B8-B25)^2/B25)","v":""},"","","","","","","","","",{"$f":"SUM(B42:K42)","v":0}]
["R3","","","","","","","","","","",0]
["R4","","","","","","","","","","",0]
["R5","","","","","","","","","","",0]
["R6","","","","","","","","","","",0]
["R7","","","","","","","","","","",0]
["R8","","","","","","","","","","",0]
["R9","","","","","","","","","","",0]
["R10","","","","","","","","","","",0]
["R11","","","","","","","","","","",0]
["R12","","","","","","","","","","",{"$f":"SUM(B52:K52)","v":0}]
["Total",{"$f":"SUM(B41:B52)","v":0},{"$f":"SUM(C41:C52)","v":0},0,0,0,0,0,0,0,{"$f":"SUM(K41:K52)","v":0},{"$f":"SUM(B53:K53)","v":0}]
[]
["Resultater:"]
[]
["Teststørrelse",{"$f":"+L53","v":0},null,null,"Hypoteser:"]
["df",{"$f":"((COUNTA(B7:K7))-1)*(COUNTA(B7:B16)-1)","v":1},null,null,"H0: Der er ingen afhængighed mellem de to variable"]
["Signifikansniveau",0.05,null,null,"H1: Der er afhængighed mellem de to variable"]
["P-værdi",{"$f":"1-_xlfn.CHISQ.DIST(B57,B58,TRUE)","v":1}]
["Kritisk værdi",{"$f":"CHIINV(B59,B58)","v":3.8414588206941236}]
[]
["Konklusion:"]
[{"$f":"IF($B$60<$B$59, \"Nullhypotesen forkastes, der er afhængighed!\", \"Nullhypotesen forkastes ikke, der er ikke afhængighed!\")","v":"Nullhypotesen forkastes ikke, der er ikke afhængighed!"}]
[]
[{"$f":"IF($B$60<$B$59, \"Er der også kausalitet/årsagssammenhæng?\", \"\")","v":""}]
[null,"C1","C2","C3","C4","C5","C6","C7","C8","C9","C10"]
["R1",{"$f":"IF(B7=\"\",\"\",IF(B7>B24,\"Overrep.\",\"Underrep\"))","v":""},{"$f":"IF(C7=\"\",\"\",IF(C7>C24,\"Overrep.\",\"Underrep\"))","v":""},"","","","","","","",""]
["R2",{"$f":"IF(B8=\"\",\"\",IF(B8>B25,\"Overrep.\",\"Underrep\"))","v":""},"","","","","","","","",""]
["R3",{"$f":"IF(B9=\"\",\"\",IF(B9>B26,\"Overrep.\",\"Underrep\"))","v":""},"","","","","","","","",""]
["R4",{"$f":"IF(B10=\"\",\"\",IF(B10>B27,\"Overrep.\",\"Underrep\"))","v":""},"","","","","","","","",""]
["R5",{"$f":"IF(B11=\"\",\"\",IF(B11>B28,\"Overrep.\",\"Underrep\"))","v":""},"","","","","","","","",""]
["R6",{"$f":"IF(B12=\"\",\"\",IF(B12>B29,\"Overrep.\",\"Underrep\"))","v":""},"","","","","","","","",""]
["R7",{"$f":"IF(B13=\"\",\"\",IF(B13>B30,\"Overrep.\",\"Underrep\"))","v":""},"","","","","","","","",""]
["R8",{"$f":"IF(B14=\"\",\"\",IF(B14>B31,\"Overrep.\",\"Underrep\"))","v":""},"","","","","","","","",""]
["R9",{"$f":"IF(B15=\"\",\"\",IF(B15>B32,\"Overrep.\",\"Underrep\"))","v":""},"","","","","","","","",""]
["R10",{"$f":"IF(B16=\"\",\"\",IF(B16>B33,\"Overrep.\",\"Underrep\"))","v":""},"","","","","","","","",""]
["R11",{"$f":"IF(B17=\"\",\"\",IF(B17>B34,\"Overrep.\",\"Underrep\"))","v":""},"","","","","","","","",""]
["R12",{"$f":"IF(B18=\"\",\"\",IF(B18>B35,\"Overrep.\",\"Underrep\"))","v":""},"","","","","","","","",""]

{"sheet":"chi_help","index":13,"n_rows":1009,"n_cols":4,"rows_kept":1009,"cut":false,"hidden":true,"merged":[]}
[]
[]
["Start",0,"Kritisk værdi",{"$f":"ROUND('Chi2-test af krydstabel'!B61,3)","v":3.8410000000000002}]
["Interval",{"$f":"MAX('Chi2-test af krydstabel'!$B$57,'Chi2-test af krydstabel'!$B$61)/800","v":4.8018235258676543E-3},"Teststørrelse",{"$f":"ROUND('Chi2-test af krydstabel'!$B$57,3)","v":0}]
[]
[]
[]
[null,"Chi2","Kritisk værdi","Teststørrelse"]
[{"$f":"+$B$3","v":0},{"$f":"_xlfn.CHISQ.DIST(A9,'Chi2-test af krydstabel'!$B$58,FALSE)","v":{"$error":"#NUM!"}},{"$f":"IF($A9<$D$3,IF($A10>$D$3,MAX($B$9:$B$1009),\"\"),\"\")","v":""},{"$f":"IF($A9<$D$4,IF($A10>$D$4,MAX($B$9:$B$1009),\"\"),\"\")","v":""}]
[{"$f":"+A9+$B$4","v":4.8018235258676543E-3},{"$f":"_xlfn.CHISQ.DIST(A10,'Chi2-test af krydstabel'!$B$58,FALSE)","v":5.7433365447517772},"",""]
[9.6036470517353086E-3,{"$f":"_xlfn.CHISQ.DIST(A11,'Chi2-test af krydstabel'!$B$58,FALSE)","v":4.0514134449454744},"",""]
[1.4405470577602962E-2,{"$f":"_xlfn.CHISQ.DIST(A12,'Chi2-test af krydstabel'!$B$58,FALSE)","v":3.3000326196549401},"",""]
[1.9207294103470617E-2,{"$f":"_xlfn.CHISQ.DIST(A13,'Chi2-test af krydstabel'!$B$58,FALSE)","v":2.8510587176571045},"",""]
[2.4009117629338272E-2,{"$f":"_xlfn.CHISQ.DIST(A14,'Chi2-test af krydstabel'!$B$58,FALSE)","v":2.5439493043873873},"",""]
[2.8810941155205928E-2,{"$f":"_xlfn.CHISQ.DIST(A15,'Chi2-test af krydstabel'!$B$58,FALSE)","v":2.3167284221552449},"",""]
[3.3612764681073583E-2,{"$f":"_xlfn.CHISQ.DIST(A16,'Chi2-test af krydstabel'!$B$58,FALSE)","v":2.1397302633421154},"",""]
[3.8414588206941234E-2,{"$f":"_xlfn.CHISQ.DIST(A17,'Chi2-test af krydstabel'!$B$58,FALSE)","v":1.9967346431179187},"",""]
[4.3216411732808886E-2,{"$f":"_xlfn.CHISQ.DIST(A18,'Chi2-test af krydstabel'!$B$58,FALSE)","v":1.8780250854957725},"",""]
[4.8018235258676538E-2,{"$f":"_xlfn.CHISQ.DIST(A19,'Chi2-test af krydstabel'!$B$58,FALSE)","v":1.7773785759569622},"",""]
[5.282005878454419E-2,{"$f":"_xlfn.CHISQ.DIST(A20,'Chi2-test af krydstabel'!$B$58,FALSE)","v":1.690600120854592},"",""]
[5.7621882310411841E-2,{"$f":"_xlfn.CHISQ.DIST(A21,'Chi2-test af krydstabel'!$B$58,FALSE)","v":1.6147448664122495},"",""]
[6.2423705836279493E-2,{"$f":"_xlfn.CHISQ.DIST(A22,'Chi2-test af krydstabel'!$B$58,FALSE)","v":1.5476763872383104},"",""]
[6.7225529362147152E-2,{"$f":"_xlfn.CHISQ.DIST(A23,'Chi2-test af krydstabel'!$B$58,FALSE)","v":1.4878019111198306},"",""]
[7.2027352888014803E-2,{"$f":"_xlfn.CHISQ.DIST(A24,'Chi2-test af krydstabel'!$B$58,FALSE)","v":1.4339063823839606},"",""]
[7.6829176413882455E-2,{"$f":"_xlfn.CHISQ.DIST(A25,'Chi2-test af krydstabel'!$B$58,FALSE)","v":1.3850445199120676},"",""]
[8.1630999939750107E-2,{"$f":"_xlfn.CHISQ.DIST(A26,'Chi2-test af krydstabel'!$B$58,FALSE)","v":1.3404683405769029},"",""]
[8.6432823465617759E-2,{"$f":"_xlfn.CHISQ.DIST(A27,'Chi2-test af krydstabel'!$B$58,FALSE)","v":1.2995771497196236},"",""]
[9.123464699148541E-2,{"$f":"_xlfn.CHISQ.DIST(A28,'Chi2-test af krydstabel'!$B$58,FALSE)","v":1.2618822048554208},"",""]
[9.6036470517353062E-2,{"$f":"_xlfn.CHISQ.DIST(A29,'Chi2-test af krydstabel'!$B$58,FALSE)","v":1.2269812209405007},"",""]
[0.10083829404322071,{"$f":"_xlfn.CHISQ.DIST(A30,'Chi2-test af krydstabel'!$B$58,FALSE)","v":1.1945396331202853},"",""]
[0.10564011756908837,{"$f":"_xlfn.CHISQ.DIST(A31,'Chi2-test af krydstabel'!$B$58,FALSE)","v":1.1642765969504079},"",""]
[0.11044194109495602,{"$f":"_xlfn.CHISQ.DIST(A32,'Chi2-test af krydstabel'!$B$58,FALSE)","v":1.1359543723168841},"",""]
[0.11524376462082367,{"$f":"_xlfn.CHISQ.DIST(A33,'Chi2-test af krydstabel'!$B$58,FALSE)","v":1.1093701649375278},"",""]
[0.12004558814669132,{"$f":"_xlfn.CHISQ.DIST(A34,'Chi2-test af krydstabel'!$B$58,FALSE)","v":1.0843497800403117},"",""]
[0.12484741167255897,{"$f":"_xlfn.CHISQ.DIST(A35,'Chi2-test af krydstabel'!$B$58,FALSE)","v":1.0607426308288526},"",""]
[0.12964923519842664,{"$f":"_xlfn.CHISQ.DIST(A36,'Chi2-test af krydstabel'!$B$58,FALSE)","v":1.03841777259788},"",""]
[0.1344510587242943,{"$f":"_xlfn.CHISQ.DIST(A37,'Chi2-test af krydstabel'!$B$58,FALSE)","v":1.0172607223200623},"",""]
[0.13925288225016197,{"$f":"_xlfn.CHISQ.DIST(A38,'Chi2-test af krydstabel'!$B$58,FALSE)","v":0.99717088617856653},"",""]
[0.14405470577602963,{"$f":"_xlfn.CHISQ.DIST(A39,'Chi2-test af krydstabel'!$B$58,FALSE)","v":0.97805946226975249},"",""]
[0.1488565293018973,{"$f":"_xlfn.CHISQ.DIST(A40,'Chi2-test af krydstabel'!$B$58,FALSE)","v":0.9598477180796976},"",""]
[0.15365835282776497,{"$f":"_xlfn.CHISQ.DIST(A41,'Chi2-test af krydstabel'!$B$58,FALSE)","v":0.94246556604901222},"",""]
[0.15846017635363263,{"$f":"_xlfn.CHISQ.DIST(A42,'Chi2-test af krydstabel'!$B$58,FALSE)","v":0.92585037809741666},"",""]
[0.1632619998795003,{"$f":"_xlfn.CHISQ.DIST(A43,'Chi2-test af krydstabel'!$B$58,FALSE)","v":0.9099459931151993},"",""]
[0.16806382340536796,{"$f":"_xlfn.CHISQ.DIST(A44,'Chi2-test af krydstabel'!$B$58,FALSE)","v":0.89470188135168738},"",""]
[0.17286564693123563,{"$f":"_xlfn.CHISQ.DIST(A45,'Chi2-test af krydstabel'!$B$58,FALSE)","v":0.88007243719495176},"",""]
[0.17766747045710329,{"$f":"_xlfn.CHISQ.DIST(A46,'Chi2-test af krydstabel'!$B$58,FALSE)","v":0.86601637765190065},"",""]
[0.18246929398297096,{"$f":"_xlfn.CHISQ.DIST(A47,'Chi2-test af krydstabel'!$B$58,FALSE)","v":0.85249622834386674},"",""]
[0.18727111750883862,{"$f":"_xlfn.CHISQ.DIST(A48,'Chi2-test af krydstabel'!$B$58,FALSE)","v":0.83947788235059728},"",""]
[0.19207294103470629,{"$f":"_xlfn.CHISQ.DIST(A49,'Chi2-test af krydstabel'!$B$58,FALSE)","v":0.82693022000138527},"",""]
[0.19687476456057396,{"$f":"_xlfn.CHISQ.DIST(A50,'Chi2-test af krydstabel'!$B$58,FALSE)","v":0.81482477990117486},"",""]
[0.20167658808644162,{"$f":"_xlfn.CHISQ.DIST(A51,'Chi2-test af krydstabel'!$B$58,FALSE)","v":0.80313547322306711},"",""]
[0.20647841161230929,{"$f":"_xlfn.CHISQ.DIST(A52,'Chi2-test af krydstabel'!$B$58,FALSE)","v":0.79183833469570319},"",""]
[0.21128023513817695,{"$f":"_xlfn.CHISQ.DIST(A53,'Chi2-test af krydstabel'!$B$58,FALSE)","v":0.78091130483974991},"",""]
[0.21608205866404462,{"$f":"_xlfn.CHISQ.DIST(A54,'Chi2-test af krydstabel'!$B$58,FALSE)","v":0.77033403891973484},"",""]
[0.22088388218991228,{"$f":"_xlfn.CHISQ.DIST(A55,'Chi2-test af krydstabel'!$B$58,FALSE)","v":0.76008773882013703},"",""]
[0.22568570571577995,{"$f":"_xlfn.CHISQ.DIST(A56,'Chi2-test af krydstabel'!$B$58,FALSE)","v":0.7501550046623382},"",""]
[0.23048752924164762,{"$f":"_xlfn.CHISQ.DIST(A57,'Chi2-test af krydstabel'!$B$58,FALSE)","v":0.74051970347863416},"",""]
[0.23528935276751528,{"$f":"_xlfn.CHISQ.DIST(A58,'Chi2-test af krydstabel'!$B$58,FALSE)","v":0.73116685267202819},"",""]
[0.24009117629338295,{"$f":"_xlfn.CHISQ.DIST(A59,'Chi2-test af krydstabel'!$B$58,FALSE)","v":0.72208251633262543},"",""]
[0.24489299981925061,{"$f":"_xlfn.CHISQ.DIST(A60,'Chi2-test af krydstabel'!$B$58,FALSE)","v":0.71325371276627536},"",""]
[0.24969482334511828,{"$f":"_xlfn.CHISQ.DIST(A61,'Chi2-test af krydstabel'!$B$58,FALSE)","v":0.70466833182919153},"",""]
[0.25449664687098594,{"$f":"_xlfn.CHISQ.DIST(A62,'Chi2-test af krydstabel'!$B$58,FALSE)","v":0.69631506086202166},"",""]
[0.25929847039685361,{"$f":"_xlfn.CHISQ.DIST(A63,'Chi2-test af krydstabel'!$B$58,FALSE)","v":0.68818331818501366},"",""]
[0.26410029392272127,{"$f":"_xlfn.CHISQ.DIST(A64,'Chi2-test af krydstabel'!$B$58,FALSE)","v":0.6802631932580202},"",""]
[0.26890211744858894,{"$f":"_xlfn.CHISQ.DIST(A65,'Chi2-test af krydstabel'!$B$58,FALSE)","v":0.67254539272951597},"",""]
[0.27370394097445661,{"$f":"_xlfn.CHISQ.DIST(A66,'Chi2-test af krydstabel'!$B$58,FALSE)","v":0.66502119170122442},"",""]
[0.27850576450032427,{"$f":"_xlfn.CHISQ.DIST(A67,'Chi2-test af krydstabel'!$B$58,FALSE)","v":0.65768238962230274},"",""]
[0.28330758802619194,{"$f":"_xlfn.CHISQ.DIST(A68,'Chi2-test af krydstabel'!$B$58,FALSE)","v":0.6505212703017581},"",""]
[0.2881094115520596,{"$f":"_xlfn.CHISQ.DIST(A69,'Chi2-test af krydstabel'!$B$58,FALSE)","v":0.64353056559187582},"",""]
[0.29291123507792727,{"$f":"_xlfn.CHISQ.DIST(A70,'Chi2-test af krydstabel'!$B$58,FALSE)","v":0.63670342235058208},"",""]
[0.29771305860379493,{"$f":"_xlfn.CHISQ.DIST(A71,'Chi2-test af krydstabel'!$B$58,FALSE)","v":0.63003337233822598},"",""]
[0.3025148821296626,{"$f":"_xlfn.CHISQ.DIST(A72,'Chi2-test af krydstabel'!$B$58,FALSE)","v":0.62351430474538283},"",""]
[0.30731670565553026,{"$f":"_xlfn.CHISQ.DIST(A73,'Chi2-test af krydstabel'!$B$58,FALSE)","v":0.61714044108393795},{"$f":"IF($A73<$D$3,IF($A74>$D$3,MAX($B$9:$B$1009),\"\"),\"\")","v":""},{"$f":"IF($A73<$D$4,IF($A74>$D$4,MAX($B$9:$B$1009),\"\"),\"\")","v":""}]
[{"$f":"+A73+$B$4","v":0.31211852918139793},{"$f":"_xlfn.CHISQ.DIST(A74,'Chi2-test af krydstabel'!$B$58,FALSE)","v":0.61090631220466718},"",""]
[0.3169203527072656,{"$f":"_xlfn.CHISQ.DIST(A75,'Chi2-test af krydstabel'!$B$58,FALSE)","v":0.6048067372315139},"",""]
[0.32172217623313326,{"$f":"_xlfn.CHISQ.DIST(A76,'Chi2-test af krydstabel'!$B$58,FALSE)","v":0.59883680422629326},"",""]
[0.32652399975900093,{"$f":"_xlfn.CHISQ.DIST(A77,'Chi2-test af krydstabel'!$B$58,FALSE)","v":0.59299185241815155},"",""]
[0.33132582328486859,{"$f":"_xlfn.CHISQ.DIST(A78,'Chi2-test af krydstabel'!$B$58,FALSE)","v":0.58726745585014684},"",""]
[0.33612764681073626,{"$f":"_xlfn.CHISQ.DIST(A79,'Chi2-test af krydstabel'!$B$58,FALSE)","v":0.58165940831118079},"",""]
[0.34092947033660392,{"$f":"_xlfn.CHISQ.DIST(A80,'Chi2-test af krydstabel'!$B$58,FALSE)","v":0.57616370943544082},"",""]
[0.34573129386247159,{"$f":"_xlfn.CHISQ.DIST(A81,'Chi2-test af krydstabel'!$B$58,FALSE)","v":0.57077655186382903},"",""]
[0.35053311738833925,{"$f":"_xlfn.CHISQ.DIST(A82,'Chi2-test af krydstabel'!$B$58,FALSE)","v":0.56549430937270073},"",""]
[0.35533494091420692,{"$f":"_xlfn.CHISQ.DIST(A83,'Chi2-test af krydstabel'!$B$58,FALSE)","v":0.56031352588485805},"",""]
[0.36013676444007459,{"$f":"_xlfn.CHISQ.DIST(A84,'Chi2-test af krydstabel'!$B$58,FALSE)","v":0.55523090528625751},"",""]
[0.36493858796594225,{"$f":"_xlfn.CHISQ.DIST(A85,'Chi2-test af krydstabel'!$B$58,FALSE)","v":0.55024330197945959},"",""]
[0.36974041149180992,{"$f":"_xlfn.CHISQ.DIST(A86,'Chi2-test af krydstabel'!$B$58,FALSE)","v":0.54534771211157562},"",""]
[0.37454223501767758,{"$f":"_xlfn.CHISQ.DIST(A87,'Chi2-test af krydstabel'!$B$58,FALSE)","v":0.54054126542046244},"",""]
[0.37934405854354525,{"$f":"_xlfn.CHISQ.DIST(A88,'Chi2-test af krydstabel'!$B$58,FALSE)","v":0.53582121764825907},"",""]
[0.38414588206941291,{"$f":"_xlfn.CHISQ.DIST(A89,'Chi2-test af krydstabel'!$B$58,FALSE)","v":0.53118494347614442},"",""]
[0.38894770559528058,{"$f":"_xlfn.CHISQ.DIST(A90,'Chi2-test af krydstabel'!$B$58,FALSE)","v":0.52662992993846547},"",""]
[0.39374952912114825,{"$f":"_xlfn.CHISQ.DIST(A91,'Chi2-test af krydstabel'!$B$58,FALSE)","v":0.52215377027822141},"",""]
[0.39855135264701591,{"$f":"_xlfn.CHISQ.DIST(A92,'Chi2-test af krydstabel'!$B$58,FALSE)","v":0.51775415820932602},"",""]
[0.40335317617288358,{"$f":"_xlfn.CHISQ.DIST(A93,'Chi2-test af krydstabel'!$B$58,FALSE)","v":0.51342888255416286},"",""]
[0.40815499969875124,{"$f":"_xlfn.CHISQ.DIST(A94,'Chi2-test af krydstabel'!$B$58,FALSE)","v":0.50917582222772717},"",""]
[0.41295682322461891,{"$f":"_xlfn.CHISQ.DIST(A95,'Chi2-test af krydstabel'!$B$58,FALSE)","v":0.50499294154215502},"",""]
[0.41775864675048657,{"$f":"_xlfn.CHISQ.DIST(A96,'Chi2-test af krydstabel'!$B$58,FALSE)","v":0.50087828580770244},"",""]
[0.42256047027635424,{"$f":"_xlfn.CHISQ.DIST(A97,'Chi2-test af krydstabel'!$B$58,FALSE)","v":0.49682997720827449},"",""]
[0.4273622938022219,{"$f":"_xlfn.CHISQ.DIST(A98,'Chi2-test af krydstabel'!$B$58,FALSE)","v":0.49284621093145703},"",""]
[0.43216411732808957,{"$f":"_xlfn.CHISQ.DIST(A99,'Chi2-test af krydstabel'!$B$58,FALSE)","v":0.48892525153467153},"",""]
[0.43696594085395724,{"$f":"_xlfn.CHISQ.DIST(A100,'Chi2-test af krydstabel'!$B$58,FALSE)","v":0.48506542953058907},"",""]
[0.4417677643798249,{"$f":"_xlfn.CHISQ.DIST(A101,'Chi2-test af krydstabel'!$B$58,FALSE)","v":0.48126513817632066},"",""]
[0.44656958790569257,{"$f":"_xlfn.CHISQ.DIST(A102,'Chi2-test af krydstabel'!$B$58,FALSE)","v":0.47752283045214006},"",""]
[0.45137141143156023,{"$f":"_xlfn.CHISQ.DIST(A103,'Chi2-test af krydstabel'!$B$58,FALSE)","v":0.47383701621664531},"",""]
[0.4561732349574279,{"$f":"_xlfn.CHISQ.DIST(A104,'Chi2-test af krydstabel'!$B$58,FALSE)","v":0.47020625952628625},"",""]
[0.46097505848329556,{"$f":"_xlfn.CHISQ.DIST(A105,'Chi2-test af krydstabel'!$B$58,FALSE)","v":0.46662917610813959},"",""]
[0.46577688200916323,{"$f":"_xlfn.CHISQ.DIST(A106,'Chi2-test af krydstabel'!$B$58,FALSE)","v":0.46310443097566634},"",""]
[0.47057870553503089,{"$f":"_xlfn.CHISQ.DIST(A107,'Chi2-test af krydstabel'!$B$58,FALSE)","v":0.45963073617797395},"",""]
[0.47538052906089856,{"$f":"_xlfn.CHISQ.DIST(A108,'Chi2-test af krydstabel'!$B$58,FALSE)","v":0.45620684867382688},"",""]
[0.48018235258676623,{"$f":"_xlfn.CHISQ.DIST(A109,'Chi2-test af krydstabel'!$B$58,FALSE)","v":0.45283156832230009},"",""]
[0.48498417611263389,{"$f":"_xlfn.CHISQ.DIST(A110,'Chi2-test af krydstabel'!$B$58,FALSE)","v":0.44950373598257642},"",""]
[0.48978599963850156,{"$f":"_xlfn.CHISQ.DIST(A111,'Chi2-test af krydstabel'!$B$58,FALSE)","v":0.44622223171594039},"",""]
[0.49458782316436922,{"$f":"_xlfn.CHISQ.DIST(A112,'Chi2-test af krydstabel'!$B$58,FALSE)","v":0.442985973083523},"",""]
[0.49938964669023689,{"$f":"_xlfn.CHISQ.DIST(A113,'Chi2-test af krydstabel'!$B$58,FALSE)","v":0.43979391353382169},"",""]
[0.50419147021610455,{"$f":"_xlfn.CHISQ.DIST(A114,'Chi2-test af krydstabel'!$B$58,FALSE)","v":0.43664504087444223},"",""]
[0.50899329374197222,{"$f":"_xlfn.CHISQ.DIST(A115,'Chi2-test af krydstabel'!$B$58,FALSE)","v":0.43353837582290472},"",""]
[0.51379511726783988,{"$f":"_xlfn.CHISQ.DIST(A116,'Chi2-test af krydstabel'!$B$58,FALSE)","v":0.43047297063171769},"",""]
[0.51859694079370755,{"$f":"_xlfn.CHISQ.DIST(A117,'Chi2-test af krydstabel'!$B$58,FALSE)","v":0.42744790778325398},"",""]
[0.52339876431957522,{"$f":"_xlfn.CHISQ.DIST(A118,'Chi2-test af krydstabel'!$B$58,FALSE)","v":0.42446229875027358},"",""]
[0.52820058784544288,{"$f":"_xlfn.CHISQ.DIST(A119,'Chi2-test af krydstabel'!$B$58,FALSE)","v":0.42151528281821926},"",""]
[0.53300241137131055,{"$f":"_xlfn.CHISQ.DIST(A120,'Chi2-test af krydstabel'!$B$58,FALSE)","v":0.41860602596567131},"",""]
[0.53780423489717821,{"$f":"_xlfn.CHISQ.DIST(A121,'Chi2-test af krydstabel'!$B$58,FALSE)","v":0.41573371979959417},"",""]
[0.54260605842304588,{"$f":"_xlfn.CHISQ.DIST(A122,'Chi2-test af krydstabel'!$B$58,FALSE)","v":0.41289758054222586},"",""]
[0.54740788194891354,{"$f":"_xlfn.CHISQ.DIST(A123,'Chi2-test af krydstabel'!$B$58,FALSE)","v":0.41009684806667113},"",""]
[0.55220970547478121,{"$f":"_xlfn.CHISQ.DIST(A124,'Chi2-test af krydstabel'!$B$58,FALSE)","v":0.40733078497845104},"",""]
[0.55701152900064888,{"$f":"_xlfn.CHISQ.DIST(A125,'Chi2-test af krydstabel'!$B$58,FALSE)","v":0.40459867574043679},"",""]
[0.56181335252651654,{"$f":"_xlfn.CHISQ.DIST(A126,'Chi2-test af krydstabel'!$B$58,FALSE)","v":0.40189982583876371},"",""]
[0.56661517605238421,{"$f":"_xlfn.CHISQ.DIST(A127,'Chi2-test af krydstabel'!$B$58,FALSE)","v":0.39923356098747076},"",""]
[0.57141699957825187,{"$f":"_xlfn.CHISQ.DIST(A128,'Chi2-test af krydstabel'!$B$58,FALSE)","v":0.39659922636975536},"",""]
[0.57621882310411954,{"$f":"_xlfn.CHISQ.DIST(A129,'Chi2-test af krydstabel'!$B$58,FALSE)","v":0.39399618591386337},"",""]
[0.5810206466299872,{"$f":"_xlfn.CHISQ.DIST(A130,'Chi2-test af krydstabel'!$B$58,FALSE)","v":0.39142382160175848},"",""]
[0.58582247015585487,{"$f":"_xlfn.CHISQ.DIST(A131,'Chi2-test af krydstabel'!$B$58,FALSE)","v":0.38888153280882737},"",""]
[0.59062429368172253,{"$f":"_xlfn.CHISQ.DIST(A132,'Chi2-test af krydstabel'!$B$58,FALSE)","v":0.38636873567298358},"",""]
[0.5954261172075902,{"$f":"_xlfn.CHISQ.DIST(A133,'Chi2-test af krydstabel'!$B$58,FALSE)","v":0.38388486249163511},"",""]
[0.60022794073345787,{"$f":"_xlfn.CHISQ.DIST(A134,'Chi2-test af krydstabel'!$B$58,FALSE)","v":0.38142936114506609},"",""]
[0.60502976425932553,{"$f":"_xlfn.CHISQ.DIST(A135,'Chi2-test af krydstabel'!$B$58,FALSE)","v":0.37900169454487675},"",""]
[0.6098315877851932,{"$f":"_xlfn.CHISQ.DIST(A136,'Chi2-test af krydstabel'!$B$58,FALSE)","v":0.37660134010619972},"",""]
[0.61463341131106086,{"$f":"_xlfn.CHISQ.DIST(A137,'Chi2-test af krydstabel'!$B$58,FALSE)","v":0.37422778924248978},{"$f":"IF($A137<$D$3,IF($A138>$D$3,MAX($B$9:$B$1009),\"\"),\"\")","v":""},{"$f":"IF($A137<$D$4,IF($A138>$D$4,MAX($B$9:$B$1009),\"\"),\"\")","v":""}]
[{"$f":"+A137+$B$4","v":0.61943523483692853},{"$f":"_xlfn.CHISQ.DIST(A138,'Chi2-test af krydstabel'!$B$58,FALSE)","v":0.37188054688175159},"",""]
[0.62423705836279619,{"$f":"_xlfn.CHISQ.DIST(A139,'Chi2-test af krydstabel'!$B$58,FALSE)","v":0.36955913100313648},"",""]
[0.62903888188866386,{"$f":"_xlfn.CHISQ.DIST(A140,'Chi2-test af krydstabel'!$B$58,FALSE)","v":0.36726307219290016},"",""]
[0.63384070541453152,{"$f":"_xlfn.CHISQ.DIST(A141,'Chi2-test af krydstabel'!$B$58,FALSE)","v":0.36499191321877128},"",""]
[0.63864252894039919,{"$f":"_xlfn.CHISQ.DIST(A142,'Chi2-test af krydstabel'!$B$58,FALSE)","v":0.36274520862183174},"",""]
[0.64344435246626686,{"$f":"_xlfn.CHISQ.DIST(A143,'Chi2-test af krydstabel'!$B$58,FALSE)","v":0.36052252432506354},"",""]
[0.64824617599213452,{"$f":"_xlfn.CHISQ.DIST(A144,'Chi2-test af krydstabel'!$B$58,FALSE)","v":0.35832343725776089},"",""]
[0.65304799951800219,{"$f":"_xlfn.CHISQ.DIST(A145,'Chi2-test af krydstabel'!$B$58,FALSE)","v":0.35614753499505186},"",""]
[0.65784982304386985,{"$f":"_xlfn.CHISQ.DIST(A146,'Chi2-test af krydstabel'!$B$58,FALSE)","v":0.35399441541181453},"",""]
[0.66265164656973752,{"$f":"_xlfn.CHISQ.DIST(A147,'Chi2-test af krydstabel'!$B$58,FALSE)","v":0.35186368635031195},"",""]
[0.66745347009560518,{"$f":"_xlfn.CHISQ.DIST(A148,'Chi2-test af krydstabel'!$B$58,FALSE)","v":0.34975496530090611},"",""]
[0.67225529362147285,{"$f":"_xlfn.CHISQ.DIST(A149,'Chi2-test af krydstabel'!$B$58,FALSE)","v":0.34766787909524549},"",""]
[0.67705711714734051,{"$f":"_xlfn.CHISQ.DIST(A150,'Chi2-test af krydstabel'!$B$58,FALSE)","v":0.34560206361135348},"",""]
[0.68185894067320818,{"$f":"_xlfn.CHISQ.DIST(A151,'Chi2-test af krydstabel'!$B$58,FALSE)","v":0.34355716349007431},"",""]
[0.68666076419907585,{"$f":"_xlfn.CHISQ.DIST(A152,'Chi2-test af krydstabel'!$B$58,FALSE)","v":0.341532831862361},"",""]
[0.69146258772494351,{"$f":"_xlfn.CHISQ.DIST(A153,'Chi2-test af krydstabel'!$B$58,FALSE)","v":0.33952873008691958},"",""]
[0.69626441125081118,{"$f":"_xlfn.CHISQ.DIST(A154,'Chi2-test af krydstabel'!$B$58,FALSE)","v":0.33754452749774544},"",""]
[0.70106623477667884,{"$f":"_xlfn.CHISQ.DIST(A155,'Chi2-test af krydstabel'!$B$58,FALSE)","v":0.33557990116111197},"",""]
[0.70586805830254651,{"$f":"_xlfn.CHISQ.DIST(A156,'Chi2-test af krydstabel'!$B$58,FALSE)","v":0.33363453564159873},"",""]
[0.71066988182841417,{"$f":"_xlfn.CHISQ.DIST(A157,'Chi2-test af krydstabel'!$B$58,FALSE)","v":0.3317081227767581},"",""]
[0.71547170535428184,{"$f":"_xlfn.CHISQ.DIST(A158,'Chi2-test af krydstabel'!$B$58,FALSE)","v":0.32980036146005004},"",""]
[0.72027352888014951,{"$f":"_xlfn.CHISQ.DIST(A159,'Chi2-test af krydstabel'!$B$58,FALSE)","v":0.32791095743168486},"",""]
[0.72507535240601717,{"$f":"_xlfn.CHISQ.DIST(A160,'Chi2-test af krydstabel'!$B$58,FALSE)","v":0.32603962307703532},"",""]
[0.72987717593188484,{"$f":"_xlfn.CHISQ.DIST(A161,'Chi2-test af krydstabel'!$B$58,FALSE)","v":0.32418607723229709},"",""]
[0.7346789994577525,{"$f":"_xlfn.CHISQ.DIST(A162,'Chi2-test af krydstabel'!$B$58,FALSE)","v":0.32235004499708819},"",""]
[0.73948082298362017,{"$f":"_xlfn.CHISQ.DIST(A163,'Chi2-test af krydstabel'!$B$58,FALSE)","v":0.32053125755369893},"",""]
[0.74428264650948783,{"$f":"_xlfn.CHISQ.DIST(A164,'Chi2-test af krydstabel'!$B$58,FALSE)","v":0.31872945199271069},"",""]
[0.7490844700353555,{"$f":"_xlfn.CHISQ.DIST(A165,'Chi2-test af krydstabel'!$B$58,FALSE)","v":0.31694437114472296},"",""]
[0.75388629356122316,{"$f":"_xlfn.CHISQ.DIST(A166,'Chi2-test af krydstabel'!$B$58,FALSE)","v":0.31517576341793424},"",""]
[0.75868811708709083,{"$f":"_xlfn.CHISQ.DIST(A167,'Chi2-test af krydstabel'!$B$58,FALSE)","v":0.31342338264133812},"",""]
[0.7634899406129585,{"$f":"_xlfn.CHISQ.DIST(A168,'Chi2-test af krydstabel'!$B$58,FALSE)","v":0.31168698791330479},"",""]
[0.76829176413882616,{"$f":"_xlfn.CHISQ.DIST(A169,'Chi2-test af krydstabel'!$B$58,FALSE)","v":0.30996634345533192},"",""]
[0.77309358766469383,{"$f":"_xlfn.CHISQ.DIST(A170,'Chi2-test af krydstabel'!$B$58,FALSE)","v":0.30826121847075516},"",""]
[0.77789541119056149,{"$f":"_xlfn.CHISQ.DIST(A171,'Chi2-test af krydstabel'!$B$58,FALSE)","v":0.30657138700822184},"",""]
[0.78269723471642916,{"$f":"_xlfn.CHISQ.DIST(A172,'Chi2-test af krydstabel'!$B$58,FALSE)","v":0.3048966278297367},"",""]
[0.78749905824229682,{"$f":"_xlfn.CHISQ.DIST(A173,'Chi2-test af krydstabel'!$B$58,FALSE)","v":0.30323672428310167},"",""]
[0.79230088176816449,{"$f":"_xlfn.CHISQ.DIST(A174,'Chi2-test af krydstabel'!$B$58,FALSE)","v":0.30159146417857496},"",""]
[0.79710270529403215,{"$f":"_xlfn.CHISQ.DIST(A175,'Chi2-test af krydstabel'!$B$58,FALSE)","v":0.29996063966958686},"",""]
[0.80190452881989982,{"$f":"_xlfn.CHISQ.DIST(A176,'Chi2-test af krydstabel'!$B$58,FALSE)","v":0.29834404713735413},"",""]
[0.80670635234576749,{"$f":"_xlfn.CHISQ.DIST(A177,'Chi2-test af krydstabel'!$B$58,FALSE)","v":0.29674148707924258},"",""]
[0.81150817587163515,{"$f":"_xlfn.CHISQ.DIST(A178,'Chi2-test af krydstabel'!$B$58,FALSE)","v":0.29515276400073553},"",""]
[0.81630999939750282,{"$f":"_xlfn.CHISQ.DIST(A179,'Chi2-test af krydstabel'!$B$58,FALSE)","v":0.29357768631086922},"",""]
[0.82111182292337048,{"$f":"_xlfn.CHISQ.DIST(A180,'Chi2-test af krydstabel'!$B$58,FALSE)","v":0.29201606622100562},"",""]
[0.82591364644923815,{"$f":"_xlfn.CHISQ.DIST(A181,'Chi2-test af krydstabel'!$B$58,FALSE)","v":0.29046771964681656},"",""]
[0.83071546997510581,{"$f":"_xlfn.CHISQ.DIST(A182,'Chi2-test af krydstabel'!$B$58,FALSE)","v":0.28893246611335777},"",""]
[0.83551729350097348,{"$f":"_xlfn.CHISQ.DIST(A183,'Chi2-test af krydstabel'!$B$58,FALSE)","v":0.28741012866312077},"",""]
[0.84031911702684114,{"$f":"_xlfn.CHISQ.DIST(A184,'Chi2-test af krydstabel'!$B$58,FALSE)","v":0.28590053376694979},"",""]
[0.84512094055270881,{"$f":"_xlfn.CHISQ.DIST(A185,'Chi2-test af krydstabel'!$B$58,FALSE)","v":0.28440351123771995},"",""]
[0.84992276407857648,{"$f":"_xlfn.CHISQ.DIST(A186,'Chi2-test af krydstabel'!$B$58,FALSE)","v":0.28291889414667515},"",""]
[0.85472458760444414,{"$f":"_xlfn.CHISQ.DIST(A187,'Chi2-test af krydstabel'!$B$58,FALSE)","v":0.28144651874232995},"",""]
[0.85952641113031181,{"$f":"_xlfn.CHISQ.DIST(A188,'Chi2-test af krydstabel'!$B$58,FALSE)","v":0.27998622437184162},"",""]
[0.86432823465617947,{"$f":"_xlfn.CHISQ.DIST(A189,'Chi2-test af krydstabel'!$B$58,FALSE)","v":0.27853785340476395},"",""]
[0.86913005818204714,{"$f":"_xlfn.CHISQ.DIST(A190,'Chi2-test af krydstabel'!$B$58,FALSE)","v":0.27710125115909873},"",""]
[0.8739318817079148,{"$f":"_xlfn.CHISQ.DIST(A191,'Chi2-test af krydstabel'!$B$58,FALSE)","v":0.27567626582956178},"",""]
[0.87873370523378247,{"$f":"_xlfn.CHISQ.DIST(A192,'Chi2-test af krydstabel'!$B$58,FALSE)","v":0.27426274841798615},"",""]
[0.88353552875965014,{"$f":"_xlfn.CHISQ.DIST(A193,'Chi2-test af krydstabel'!$B$58,FALSE)","v":0.27286055266578763},"",""]
[0.8883373522855178,{"$f":"_xlfn.CHISQ.DIST(A194,'Chi2-test af krydstabel'!$B$58,FALSE)","v":0.27146953498841941},"",""]
[0.89313917581138547,{"$f":"_xlfn.CHISQ.DIST(A195,'Chi2-test af krydstabel'!$B$58,FALSE)","v":0.27008955441174809},"",""]
[0.89794099933725313,{"$f":"_xlfn.CHISQ.DIST(A196,'Chi2-test af krydstabel'!$B$58,FALSE)","v":0.26872047251028364},"",""]
[0.9027428228631208,{"$f":"_xlfn.CHISQ.DIST(A197,'Chi2-test af krydstabel'!$B$58,FALSE)","v":0.26736215334719982},"",""]
[0.90754464638898846,{"$f":"_xlfn.CHISQ.DIST(A198,'Chi2-test af krydstabel'!$B$58,FALSE)","v":0.26601446341608442},"",""]
[0.91234646991485613,{"$f":"_xlfn.CHISQ.DIST(A199,'Chi2-test af krydstabel'!$B$58,FALSE)","v":0.26467727158435927},"",""]
[0.91714829344072379,{"$f":"_xlfn.CHISQ.DIST(A200,'Chi2-test af krydstabel'!$B$58,FALSE)","v":0.26335044903831484},"",""]
[0.92195011696659146,{"$f":"_xlfn.CHISQ.DIST(A201,'Chi2-test af krydstabel'!$B$58,FALSE)","v":0.26203386922970395},{"$f":"IF($A201<$D$3,IF($A202>$D$3,MAX($B$9:$B$1009),\"\"),\"\")","v":""},{"$f":"IF($A201<$D$4,IF($A202>$D$4,MAX($B$9:$B$1009),\"\"),\"\")","v":""}]
[{"$f":"+A201+$B$4","v":0.92675194049245913},{"$f":"_xlfn.CHISQ.DIST(A202,'Chi2-test af krydstabel'!$B$58,FALSE)","v":0.26072740782384324},"",""]
[0.93155376401832679,{"$f":"_xlfn.CHISQ.DIST(A203,'Chi2-test af krydstabel'!$B$58,FALSE)","v":0.25943094264917183},"",""]
[0.93635558754419446,{"$f":"_xlfn.CHISQ.DIST(A204,'Chi2-test af krydstabel'!$B$58,FALSE)","v":0.25814435364821869},"",""]
[0.94115741107006212,{"$f":"_xlfn.CHISQ.DIST(A205,'Chi2-test af krydstabel'!$B$58,FALSE)","v":0.25686752282993247},"",""]
[0.94595923459592979,{"$f":"_xlfn.CHISQ.DIST(A206,'Chi2-test af krydstabel'!$B$58,FALSE)","v":0.25560033422332945},"",""]
[0.95076105812179745,{"$f":"_xlfn.CHISQ.DIST(A207,'Chi2-test af krydstabel'!$B$58,FALSE)","v":0.25434267383241577},"",""]
[0.95556288164766512,{"$f":"_xlfn.CHISQ.DIST(A208,'Chi2-test af krydstabel'!$B$58,FALSE)","v":0.25309442959234352},{"$f":"IF($A208<$D$3,IF($A209>$D$3,MAX($B$9:$B$1009),\"\"),\"\")","v":""},""]
[0.96036470517353278,{"$f":"_xlfn.CHISQ.DIST(A209,'Chi2-test af krydstabel'!$B$58,FALSE)","v":0.25185549132676005},"",""]
[0.96516652869940045,{"$f":"_xlfn.CHISQ.DIST(A210,'Chi2-test af krydstabel'!$B$58,FALSE)","v":0.25062575070631271},"",""]
[0.96996835222526812,{"$f":"_xlfn.CHISQ.DIST(A211,'Chi2-test af krydstabel'!$B$58,FALSE)","v":0.24940510120827161},"",""]
[0.97477017575113578,{"$f":"_xlfn.CHISQ.DIST(A212,'Chi2-test af krydstabel'!$B$58,FALSE)","v":0.24819343807723526},"",""]
[0.97957199927700345,{"$f":"_xlfn.CHISQ.DIST(A213,'Chi2-test af krydstabel'!$B$58,FALSE)","v":0.2469906582868846},"",""]
[0.98437382280287111,{"$f":"_xlfn.CHISQ.DIST(A214,'Chi2-test af krydstabel'!$B$58,FALSE)","v":0.2457966605027522},"",""]
[0.98917564632873878,{"$f":"_xlfn.CHISQ.DIST(A215,'Chi2-test af krydstabel'!$B$58,FALSE)","v":0.2446113450459752},"",""]
[0.99397746985460644,{"$f":"_xlfn.CHISQ.DIST(A216,'Chi2-test af krydstabel'!$B$58,FALSE)","v":0.24343461385800111},"",""]
[0.99877929338047411,{"$f":"_xlfn.CHISQ.DIST(A217,'Chi2-test af krydstabel'!$B$58,FALSE)","v":0.24226637046621652},"",""]
[1.0035811169063418,{"$f":"_xlfn.CHISQ.DIST(A218,'Chi2-test af krydstabel'!$B$58,FALSE)","v":0.2411065199504713},"",""]
[1.0083829404322093,{"$f":"_xlfn.CHISQ.DIST(A219,'Chi2-test af krydstabel'!$B$58,FALSE)","v":0.23995496891046919},"",""]
[1.0131847639580769,{"$f":"_xlfn.CHISQ.DIST(A220,'Chi2-test af krydstabel'!$B$58,FALSE)","v":0.2388116254339995},"",""]
[1.0179865874839444,{"$f":"_xlfn.CHISQ.DIST(A221,'Chi2-test af krydstabel'!$B$58,FALSE)","v":0.23767639906598412},"",""]
[1.022788411009812,{"$f":"_xlfn.CHISQ.DIST(A222,'Chi2-test af krydstabel'!$B$58,FALSE)","v":0.23654920077831446},"",""]
[1.0275902345356795,{"$f":"_xlfn.CHISQ.DIST(A223,'Chi2-test af krydstabel'!$B$58,FALSE)","v":0.23542994294045527},"",""]
[1.0323920580615471,{"$f":"_xlfn.CHISQ.DIST(A224,'Chi2-test af krydstabel'!$B$58,FALSE)","v":0.23431853929079194},"",""]
[1.0371938815874147,{"$f":"_xlfn.CHISQ.DIST(A225,'Chi2-test af krydstabel'!$B$58,FALSE)","v":0.23321490490869881},"",""]
[1.0419957051132822,{"$f":"_xlfn.CHISQ.DIST(A226,'Chi2-test af krydstabel'!$B$58,FALSE)","v":0.23211895618730793},"",""]
[1.0467975286391498,{"$f":"_xlfn.CHISQ.DIST(A227,'Chi2-test af krydstabel'!$B$58,FALSE)","v":0.2310306108069563},"",""]
[1.0515993521650173,{"$f":"_xlfn.CHISQ.DIST(A228,'Chi2-test af krydstabel'!$B$58,FALSE)","v":0.22994978770929286},"",""]
[1.0564011756908849,{"$f":"_xlfn.CHISQ.DIST(A229,'Chi2-test af krydstabel'!$B$58,FALSE)","v":0.2288764070720247},"",""]
[1.0612029992167524,{"$f":"_xlfn.CHISQ.DIST(A230,'Chi2-test af krydstabel'!$B$58,FALSE)","v":0.22781039028428485},"",""]
[1.06600482274262,{"$f":"_xlfn.CHISQ.DIST(A231,'Chi2-test af krydstabel'!$B$58,FALSE)","v":0.22675165992260268},"",""]
[1.0708066462684875,{"$f":"_xlfn.CHISQ.DIST(A232,'Chi2-test af krydstabel'!$B$58,FALSE)","v":0.22570013972746045},"",""]
[1.0756084697943551,{"$f":"_xlfn.CHISQ.DIST(A233,'Chi2-test af krydstabel'!$B$58,FALSE)","v":0.22465575458041809},"",""]
[1.0804102933202226,{"$f":"_xlfn.CHISQ.DIST(A234,'Chi2-test af krydstabel'!$B$58,FALSE)","v":0.22361843048179061},"",""]
[1.0852121168460902,{"$f":"_xlfn.CHISQ.DIST(A235,'Chi2-test af krydstabel'!$B$58,FALSE)","v":0.2225880945288623},"",""]
[1.0900139403719578,{"$f":"_xlfn.CHISQ.DIST(A236,'Chi2-test af krydstabel'!$B$58,FALSE)","v":0.22156467489462206},"",""]
[1.0948157638978253,{"$f":"_xlfn.CHISQ.DIST(A237,'Chi2-test af krydstabel'!$B$58,FALSE)","v":0.22054810080700563},"",""]
[1.0996175874236929,{"$f":"_xlfn.CHISQ.DIST(A238,'Chi2-test af krydstabel'!$B$58,FALSE)","v":0.21953830252863007},"",""]
[1.1044194109495604,{"$f":"_xlfn.CHISQ.DIST(A239,'Chi2-test af krydstabel'!$B$58,FALSE)","v":0.21853521133700696},"",""]
[1.109221234475428,{"$f":"_xlfn.CHISQ.DIST(A240,'Chi2-test af krydstabel'!$B$58,FALSE)","v":0.21753875950522045},"",""]
[1.1140230580012955,{"$f":"_xlfn.CHISQ.DIST(A241,'Chi2-test af krydstabel'!$B$58,FALSE)","v":0.21654888028305813},"",""]
[1.1188248815271631,{"$f":"_xlfn.CHISQ.DIST(A242,'Chi2-test af krydstabel'!$B$58,FALSE)","v":0.21556550787858114},"",""]
[1.1236267050530306,{"$f":"_xlfn.CHISQ.DIST(A243,'Chi2-test af krydstabel'!$B$58,FALSE)","v":0.21458857744012236},"",""]
[1.1284285285788982,{"$f":"_xlfn.CHISQ.DIST(A244,'Chi2-test af krydstabel'!$B$58,FALSE)","v":0.21361802503870009},"",""]
[1.1332303521047657,{"$f":"_xlfn.CHISQ.DIST(A245,'Chi2-test af krydstabel'!$B$58,FALSE)","v":0.21265378765083678},"",""]
[1.1380321756306333,{"$f":"_xlfn.CHISQ.DIST(A246,'Chi2-test af krydstabel'!$B$58,FALSE)","v":0.21169580314177064},"",""]
[1.1428339991565009,{"$f":"_xlfn.CHISQ.DIST(A247,'Chi2-test af krydstabel'!$B$58,FALSE)","v":0.21074401024905079},"",""]
[1.1476358226823684,{"$f":"_xlfn.CHISQ.DIST(A248,'Chi2-test af krydstabel'!$B$58,FALSE)","v":0.20979834856650442},"",""]
[1.152437646208236,{"$f":"_xlfn.CHISQ.DIST(A249,'Chi2-test af krydstabel'!$B$58,FALSE)","v":0.20885875852856697},"",""]
[1.1572394697341035,{"$f":"_xlfn.CHISQ.DIST(A250,'Chi2-test af krydstabel'!$B$58,FALSE)","v":0.20792518139496474},"",""]
[1.1620412932599711,{"$f":"_xlfn.CHISQ.DIST(A251,'Chi2-test af krydstabel'!$B$58,FALSE)","v":0.20699755923574098},"",""]
[1.1668431167858386,{"$f":"_xlfn.CHISQ.DIST(A252,'Chi2-test af krydstabel'!$B$58,FALSE)","v":0.20607583491661688},"",""]
[1.1716449403117062,{"$f":"_xlfn.CHISQ.DIST(A253,'Chi2-test af krydstabel'!$B$58,FALSE)","v":0.20515995208467713},"",""]
[1.1764467638375737,{"$f":"_xlfn.CHISQ.DIST(A254,'Chi2-test af krydstabel'!$B$58,FALSE)","v":0.20424985515437327},"",""]
[1.1812485873634413,{"$f":"_xlfn.CHISQ.DIST(A255,'Chi2-test af krydstabel'!$B$58,FALSE)","v":0.20334548929383509},"",""]
[1.1860504108893088,{"$f":"_xlfn.CHISQ.DIST(A256,'Chi2-test af krydstabel'!$B$58,FALSE)","v":0.20244680041148294},"",""]
[1.1908522344151764,{"$f":"_xlfn.CHISQ.DIST(A257,'Chi2-test af krydstabel'!$B$58,FALSE)","v":0.20155373514293279},"",""]
[1.195654057941044,{"$f":"_xlfn.CHISQ.DIST(A258,'Chi2-test af krydstabel'!$B$58,FALSE)","v":0.20066624083818621},"",""]
[1.2004558814669115,{"$f":"_xlfn.CHISQ.DIST(A259,'Chi2-test af krydstabel'!$B$58,FALSE)","v":0.19978426554909856},"",""]
[1.2052577049927791,{"$f":"_xlfn.CHISQ.DIST(A260,'Chi2-test af krydstabel'!$B$58,FALSE)","v":0.19890775801711763},"",""]
[1.2100595285186466,{"$f":"_xlfn.CHISQ.DIST(A261,'Chi2-test af krydstabel'!$B$58,FALSE)","v":0.19803666766128616},"",""]
[1.2148613520445142,{"$f":"_xlfn.CHISQ.DIST(A262,'Chi2-test af krydstabel'!$B$58,FALSE)","v":0.19717094456650155},"",""]
[1.2196631755703817,{"$f":"_xlfn.CHISQ.DIST(A263,'Chi2-test af krydstabel'!$B$58,FALSE)","v":0.19631053947202592},"",""]
[1.2244649990962493,{"$f":"_xlfn.CHISQ.DIST(A264,'Chi2-test af krydstabel'!$B$58,FALSE)","v":0.19545540376024043},"",""]
[1.2292668226221168,{"$f":"_xlfn.CHISQ.DIST(A265,'Chi2-test af krydstabel'!$B$58,FALSE)","v":0.1946054894456378},{"$f":"IF($A265<$D$3,IF($A266>$D$3,MAX($B$9:$B$1009),\"\"),\"\")","v":""},{"$f":"IF($A265<$D$4,IF($A266>$D$4,MAX($B$9:$B$1009),\"\"),\"\")","v":""}]
[{"$f":"+A265+$B$4","v":1.2340686461479844},{"$f":"_xlfn.CHISQ.DIST(A266,'Chi2-test af krydstabel'!$B$58,FALSE)","v":0.19376074916404701},"",""]
[1.2388704696738519,{"$f":"_xlfn.CHISQ.DIST(A267,'Chi2-test af krydstabel'!$B$58,FALSE)","v":0.19292113616208387},"",""]
[1.2436722931997195,{"$f":"_xlfn.CHISQ.DIST(A268,'Chi2-test af krydstabel'!$B$58,FALSE)","v":0.19208660428682287},"",""]
[1.2484741167255871,{"$f":"_xlfn.CHISQ.DIST(A269,'Chi2-test af krydstabel'!$B$58,FALSE)","v":0.19125710797568379},"",""]
[1.2532759402514546,{"$f":"_xlfn.CHISQ.DIST(A270,'Chi2-test af krydstabel'!$B$58,FALSE)","v":0.19043260224652864},"",""]
[1.2580777637773222,{"$f":"_xlfn.CHISQ.DIST(A271,'Chi2-test af krydstabel'!$B$58,FALSE)","v":0.18961304268796278},"",""]
[1.2628795873031897,{"$f":"_xlfn.CHISQ.DIST(A272,'Chi2-test af krydstabel'!$B$58,FALSE)","v":0.18879838544983646},"",""]
[1.2676814108290573,{"$f":"_xlfn.CHISQ.DIST(A273,'Chi2-test af krydstabel'!$B$58,FALSE)","v":0.18798858723394068},"",""]
[1.2724832343549248,{"$f":"_xlfn.CHISQ.DIST(A274,'Chi2-test af krydstabel'!$B$58,FALSE)","v":0.18718360528489347},"",""]
[1.2772850578807924,{"$f":"_xlfn.CHISQ.DIST(A275,'Chi2-test af krydstabel'!$B$58,FALSE)","v":0.18638339738121154},"",""]
[1.2820868814066599,{"$f":"_xlfn.CHISQ.DIST(A276,'Chi2-test af krydstabel'!$B$58,FALSE)","v":0.18558792182656328},"",""]
[1.2868887049325275,{"$f":"_xlfn.CHISQ.DIST(A277,'Chi2-test af krydstabel'!$B$58,FALSE)","v":0.18479713744119805},"",""]
[1.291690528458395,{"$f":"_xlfn.CHISQ.DIST(A278,'Chi2-test af krydstabel'!$B$58,FALSE)","v":0.18401100355354824},"",""]
[1.2964923519842626,{"$f":"_xlfn.CHISQ.DIST(A279,'Chi2-test af krydstabel'!$B$58,FALSE)","v":0.18322947999199968},"",""]
[1.3012941755101302,{"$f":"_xlfn.CHISQ.DIST(A280,'Chi2-test af krydstabel'!$B$58,FALSE)","v":0.18245252707682635},"",""]
[1.3060959990359977,{"$f":"_xlfn.CHISQ.DIST(A281,'Chi2-test af krydstabel'!$B$58,FALSE)","v":0.18168010561228551},"",""]
[1.3108978225618653,{"$f":"_xlfn.CHISQ.DIST(A282,'Chi2-test af krydstabel'!$B$58,FALSE)","v":0.18091217687886962},"",""]
[1.3156996460877328,{"$f":"_xlfn.CHISQ.DIST(A283,'Chi2-test af krydstabel'!$B$58,FALSE)","v":0.1801487026257115},"",""]
[1.3205014696136004,{"$f":"_xlfn.CHISQ.DIST(A284,'Chi2-test af krydstabel'!$B$58,FALSE)","v":0.17938964506313823},"",""]
[1.3253032931394679,{"$f":"_xlfn.CHISQ.DIST(A285,'Chi2-test af krydstabel'!$B$58,FALSE)","v":0.17863496685537192},"",""]
[1.3301051166653355,{"$f":"_xlfn.CHISQ.DIST(A286,'Chi2-test af krydstabel'!$B$58,FALSE)","v":0.17788463111337238},"",""]
[1.334906940191203,{"$f":"_xlfn.CHISQ.DIST(A287,'Chi2-test af krydstabel'!$B$58,FALSE)","v":0.17713860138781923},"",""]
[1.3397087637170706,{"$f":"_xlfn.CHISQ.DIST(A288,'Chi2-test af krydstabel'!$B$58,FALSE)","v":0.17639684166223016},"",""]
[1.3445105872429381,{"$f":"_xlfn.CHISQ.DIST(A289,'Chi2-test af krydstabel'!$B$58,FALSE)","v":0.17565931634621207},"",""]
[1.3493124107688057,{"$f":"_xlfn.CHISQ.DIST(A290,'Chi2-test af krydstabel'!$B$58,FALSE)","v":0.17492599026884198},"",""]
[1.3541142342946733,{"$f":"_xlfn.CHISQ.DIST(A291,'Chi2-test af krydstabel'!$B$58,FALSE)","v":0.17419682867217512},"",""]
[1.3589160578205408,{"$f":"_xlfn.CHISQ.DIST(A292,'Chi2-test af krydstabel'!$B$58,FALSE)","v":0.17347179720487663},"",""]
[1.3637178813464084,{"$f":"_xlfn.CHISQ.DIST(A293,'Chi2-test af krydstabel'!$B$58,FALSE)","v":0.17275086191597505},"",""]
[1.3685197048722759,{"$f":"_xlfn.CHISQ.DIST(A294,'Chi2-test af krydstabel'!$B$58,FALSE)","v":0.17203398924873378},"",""]
[1.3733215283981435,{"$f":"_xlfn.CHISQ.DIST(A295,'Chi2-test af krydstabel'!$B$58,FALSE)","v":0.17132114603463863},"",""]
[1.378123351924011,{"$f":"_xlfn.CHISQ.DIST(A296,'Chi2-test af krydstabel'!$B$58,FALSE)","v":0.17061229948749868},"",""]
[1.3829251754498786,{"$f":"_xlfn.CHISQ.DIST(A297,'Chi2-test af krydstabel'!$B$58,FALSE)","v":0.16990741719765742},"",""]
[1.3877269989757461,{"$f":"_xlfn.CHISQ.DIST(A298,'Chi2-test af krydstabel'!$B$58,FALSE)","v":0.1692064671263129},"",""]
[1.3925288225016137,{"$f":"_xlfn.CHISQ.DIST(A299,'Chi2-test af krydstabel'!$B$58,FALSE)","v":0.1685094175999427},"",""]
[1.3973306460274812,{"$f":"_xlfn.CHISQ.DIST(A300,'Chi2-test af krydstabel'!$B$58,FALSE)","v":0.16781623730483342},"",""]
[1.4021324695533488,{"$f":"_xlfn.CHISQ.DIST(A301,'Chi2-test af krydstabel'!$B$58,FALSE)","v":0.1671268952817106},"",""]
[1.4069342930792164,{"$f":"_xlfn.CHISQ.DIST(A302,'Chi2-test af krydstabel'!$B$58,FALSE)","v":0.16644136092046818},"",""]
[1.4117361166050839,{"$f":"_xlfn.CHISQ.DIST(A303,'Chi2-test af krydstabel'!$B$58,FALSE)","v":0.16575960395499448},"",""]
[1.4165379401309515,{"$f":"_xlfn.CHISQ.DIST(A304,'Chi2-test af krydstabel'!$B$58,FALSE)","v":0.16508159445809298},"",""]
[1.421339763656819,{"$f":"_xlfn.CHISQ.DIST(A305,'Chi2-test af krydstabel'!$B$58,FALSE)","v":0.16440730283649582},"",""]
[1.4261415871826866,{"$f":"_xlfn.CHISQ.DIST(A306,'Chi2-test af krydstabel'!$B$58,FALSE)","v":0.16373669982596811},"",""]
[1.4309434107085541,{"$f":"_xlfn.CHISQ.DIST(A307,'Chi2-test af krydstabel'!$B$58,FALSE)","v":0.16306975648650049},"",""]
[1.4357452342344217,{"$f":"_xlfn.CHISQ.DIST(A308,'Chi2-test af krydstabel'!$B$58,FALSE)","v":0.16240644419758904},"",""]
[1.4405470577602892,{"$f":"_xlfn.CHISQ.DIST(A309,'Chi2-test af krydstabel'!$B$58,FALSE)","v":0.16174673465359971},"",""]
[1.4453488812861568,{"$f":"_xlfn.CHISQ.DIST(A310,'Chi2-test af krydstabel'!$B$58,FALSE)","v":0.16109059985921623},"",""]
[1.4501507048120243,{"$f":"_xlfn.CHISQ.DIST(A311,'Chi2-test af krydstabel'!$B$58,FALSE)","v":0.16043801212496889},"",""]
[1.4549525283378919,{"$f":"_xlfn.CHISQ.DIST(A312,'Chi2-test af krydstabel'!$B$58,FALSE)","v":0.15978894406284372},"",""]
[1.4597543518637595,{"$f":"_xlfn.CHISQ.DIST(A313,'Chi2-test af krydstabel'!$B$58,FALSE)","v":0.15914336858196876},"",""]
[1.464556175389627,{"$f":"_xlfn.CHISQ.DIST(A314,'Chi2-test af krydstabel'!$B$58,FALSE)","v":0.15850125888437727},"",""]
[1.4693579989154946,{"$f":"_xlfn.CHISQ.DIST(A315,'Chi2-test af krydstabel'!$B$58,FALSE)","v":0.15786258846084539},"",""]
[1.4741598224413621,{"$f":"_xlfn.CHISQ.DIST(A316,'Chi2-test af krydstabel'!$B$58,FALSE)","v":0.15722733108680287},"",""]
[1.4789616459672297,{"$f":"_xlfn.CHISQ.DIST(A317,'Chi2-test af krydstabel'!$B$58,FALSE)","v":0.15659546081831582},"",""]
[1.4837634694930972,{"$f":"_xlfn.CHISQ.DIST(A318,'Chi2-test af krydstabel'!$B$58,FALSE)","v":0.15596695198813898},"",""]
[1.4885652930189648,{"$f":"_xlfn.CHISQ.DIST(A319,'Chi2-test af krydstabel'!$B$58,FALSE)","v":0.15534177920183725},"",""]
[1.4933671165448323,{"$f":"_xlfn.CHISQ.DIST(A320,'Chi2-test af krydstabel'!$B$58,FALSE)","v":0.15471991733397403},"",""]
[1.4981689400706999,{"$f":"_xlfn.CHISQ.DIST(A321,'Chi2-test af krydstabel'!$B$58,FALSE)","v":0.15410134152436583},"",""]
[1.5029707635965674,{"$f":"_xlfn.CHISQ.DIST(A322,'Chi2-test af krydstabel'!$B$58,FALSE)","v":0.15348602717440102},"",""]
[1.507772587122435,{"$f":"_xlfn.CHISQ.DIST(A323,'Chi2-test af krydstabel'!$B$58,FALSE)","v":0.15287394994342213},"",""]
[1.5125744106483026,{"$f":"_xlfn.CHISQ.DIST(A324,'Chi2-test af krydstabel'!$B$58,FALSE)","v":0.15226508574516984},"",""]
[1.5173762341741701,{"$f":"_xlfn.CHISQ.DIST(A325,'Chi2-test af krydstabel'!$B$58,FALSE)","v":0.15165941074428771},"",""]
[1.5221780577000377,{"$f":"_xlfn.CHISQ.DIST(A326,'Chi2-test af krydstabel'!$B$58,FALSE)","v":0.15105690135288624},"",""]
[1.5269798812259052,{"$f":"_xlfn.CHISQ.DIST(A327,'Chi2-test af krydstabel'!$B$58,FALSE)","v":0.15045753422716548},"",""]
[1.5317817047517728,{"$f":"_xlfn.CHISQ.DIST(A328,'Chi2-test af krydstabel'!$B$58,FALSE)","v":0.14986128626409426},"",""]
[1.5365835282776403,{"$f":"_xlfn.CHISQ.DIST(A329,'Chi2-test af krydstabel'!$B$58,FALSE)","v":0.14926813459814553},{"$f":"IF($A329<$D$3,IF($A330>$D$3,MAX($B$9:$B$1009),\"\"),\"\")","v":""},{"$f":"IF($A329<$D$4,IF($A330>$D$4,MAX($B$9:$B$1009),\"\"),\"\")","v":""}]
[{"$f":"+A329+$B$4","v":1.5413853518035079},{"$f":"_xlfn.CHISQ.DIST(A330,'Chi2-test af krydstabel'!$B$58,FALSE)","v":0.14867805659808678},"",""]
[1.5461871753293754,{"$f":"_xlfn.CHISQ.DIST(A331,'Chi2-test af krydstabel'!$B$58,FALSE)","v":0.1480910298638235},"",""]
[1.550988998855243,{"$f":"_xlfn.CHISQ.DIST(A332,'Chi2-test af krydstabel'!$B$58,FALSE)","v":0.14750703222329606},"",""]
[1.5557908223811105,{"$f":"_xlfn.CHISQ.DIST(A333,'Chi2-test af krydstabel'!$B$58,FALSE)","v":0.14692604172942744},"",""]
[1.5605926459069781,{"$f":"_xlfn.CHISQ.DIST(A334,'Chi2-test af krydstabel'!$B$58,FALSE)","v":0.14634803665712218},"",""]
[1.5653944694328457,{"$f":"_xlfn.CHISQ.DIST(A335,'Chi2-test af krydstabel'!$B$58,FALSE)","v":0.14577299550031447},"",""]
[1.5701962929587132,{"$f":"_xlfn.CHISQ.DIST(A336,'Chi2-test af krydstabel'!$B$58,FALSE)","v":0.14520089696906507},"",""]
[1.5749981164845808,{"$f":"_xlfn.CHISQ.DIST(A337,'Chi2-test af krydstabel'!$B$58,FALSE)","v":0.14463171998670568},"",""]
[1.5797999400104483,{"$f":"_xlfn.CHISQ.DIST(A338,'Chi2-test af krydstabel'!$B$58,FALSE)","v":0.14406544368703034},"",""]
[1.5846017635363159,{"$f":"_xlfn.CHISQ.DIST(A339,'Chi2-test af krydstabel'!$B$58,FALSE)","v":0.14350204741153241},"",""]
[1.5894035870621834,{"$f":"_xlfn.CHISQ.DIST(A340,'Chi2-test af krydstabel'!$B$58,FALSE)","v":0.14294151070668656},"",""]
[1.594205410588051,{"$f":"_xlfn.CHISQ.DIST(A341,'Chi2-test af krydstabel'!$B$58,FALSE)","v":0.14238381332127475},"",""]
[1.5990072341139185,{"$f":"_xlfn.CHISQ.DIST(A342,'Chi2-test af krydstabel'!$B$58,FALSE)","v":0.14182893520375559},"",""]
[1.6038090576397861,{"$f":"_xlfn.CHISQ.DIST(A343,'Chi2-test af krydstabel'!$B$58,FALSE)","v":0.14127685649967595},"",""]
[1.6086108811656536,{"$f":"_xlfn.CHISQ.DIST(A344,'Chi2-test af krydstabel'!$B$58,FALSE)","v":0.14072755754912417},"",""]
[1.6134127046915212,{"$f":"_xlfn.CHISQ.DIST(A345,'Chi2-test af krydstabel'!$B$58,FALSE)","v":0.14018101888422393},"",""]
[1.6182145282173888,{"$f":"_xlfn.CHISQ.DIST(A346,'Chi2-test af krydstabel'!$B$58,FALSE)","v":0.13963722122666858},"",""]
[1.6230163517432563,{"$f":"_xlfn.CHISQ.DIST(A347,'Chi2-test af krydstabel'!$B$58,FALSE)","v":0.139096145485294},"",""]
[1.6278181752691239,{"$f":"_xlfn.CHISQ.DIST(A348,'Chi2-test af krydstabel'!$B$58,FALSE)","v":0.13855777275369061},"",""]
[1.6326199987949914,{"$f":"_xlfn.CHISQ.DIST(A349,'Chi2-test af krydstabel'!$B$58,FALSE)","v":0.1380220843078527},"",""]
[1.637421822320859,{"$f":"_xlfn.CHISQ.DIST(A350,'Chi2-test af krydstabel'!$B$58,FALSE)","v":0.13748906160386523},"",""]
[1.6422236458467265,{"$f":"_xlfn.CHISQ.DIST(A351,'Chi2-test af krydstabel'!$B$58,FALSE)","v":0.13695868627562663},"",""]
[1.6470254693725941,{"$f":"_xlfn.CHISQ.DIST(A352,'Chi2-test af krydstabel'!$B$58,FALSE)","v":0.13643094013260745},"",""]
[1.6518272928984616,{"$f":"_xlfn.CHISQ.DIST(A353,'Chi2-test af krydstabel'!$B$58,FALSE)","v":0.13590580515764422},"",""]
[1.6566291164243292,{"$f":"_xlfn.CHISQ.DIST(A354,'Chi2-test af krydstabel'!$B$58,FALSE)","v":0.13538326350476723},"",""]
[1.6614309399501968,{"$f":"_xlfn.CHISQ.DIST(A355,'Chi2-test af krydstabel'!$B$58,FALSE)","v":0.13486329749706247},"",""]
[1.6662327634760643,{"$f":"_xlfn.CHISQ.DIST(A356,'Chi2-test af krydstabel'!$B$58,FALSE)","v":0.13434588962456656},"",""]
[1.6710345870019319,{"$f":"_xlfn.CHISQ.DIST(A357,'Chi2-test af krydstabel'!$B$58,FALSE)","v":0.13383102254219417},"",""]
[1.6758364105277994,{"$f":"_xlfn.CHISQ.DIST(A358,'Chi2-test af krydstabel'!$B$58,FALSE)","v":0.13331867906769726},"",""]
[1.680638234053667,{"$f":"_xlfn.CHISQ.DIST(A359,'Chi2-test af krydstabel'!$B$58,FALSE)","v":0.13280884217965572},"",""]
[1.6854400575795345,{"$f":"_xlfn.CHISQ.DIST(A360,'Chi2-test af krydstabel'!$B$58,FALSE)","v":0.1323014950154989},"",""]
[1.6902418811054021,{"$f":"_xlfn.CHISQ.DIST(A361,'Chi2-test af krydstabel'!$B$58,FALSE)","v":0.1317966208695571},"",""]
[1.6950437046312696,{"$f":"_xlfn.CHISQ.DIST(A362,'Chi2-test af krydstabel'!$B$58,FALSE)","v":0.13129420319114279},"",""]
[1.6998455281571372,{"$f":"_xlfn.CHISQ.DIST(A363,'Chi2-test af krydstabel'!$B$58,FALSE)","v":0.1307942255826611},"",""]
[1.7046473516830047,{"$f":"_xlfn.CHISQ.DIST(A364,'Chi2-test af krydstabel'!$B$58,FALSE)","v":0.13029667179774856},"",""]
[1.7094491752088723,{"$f":"_xlfn.CHISQ.DIST(A365,'Chi2-test af krydstabel'!$B$58,FALSE)","v":0.12980152573944023},"",""]
[1.7142509987347399,{"$f":"_xlfn.CHISQ.DIST(A366,'Chi2-test af krydstabel'!$B$58,FALSE)","v":0.12930877145836428},"",""]
[1.7190528222606074,{"$f":"_xlfn.CHISQ.DIST(A367,'Chi2-test af krydstabel'!$B$58,FALSE)","v":0.12881839315096349},"",""]
[1.723854645786475,{"$f":"_xlfn.CHISQ.DIST(A368,'Chi2-test af krydstabel'!$B$58,FALSE)","v":0.12833037515774368},"",""]
[1.7286564693123425,{"$f":"_xlfn.CHISQ.DIST(A369,'Chi2-test af krydstabel'!$B$58,FALSE)","v":0.12784470196154787},"",""]
[1.7334582928382101,{"$f":"_xlfn.CHISQ.DIST(A370,'Chi2-test af krydstabel'!$B$58,FALSE)","v":0.12736135818585648},"",""]
[1.7382601163640776,{"$f":"_xlfn.CHISQ.DIST(A371,'Chi2-test af krydstabel'!$B$58,FALSE)","v":0.12688032859311227},"",""]
[1.7430619398899452,{"$f":"_xlfn.CHISQ.DIST(A372,'Chi2-test af krydstabel'!$B$58,FALSE)","v":0.12640159808307055},"",""]
[1.7478637634158127,{"$f":"_xlfn.CHISQ.DIST(A373,'Chi2-test af krydstabel'!$B$58,FALSE)","v":0.12592515169117333},"",""]
[1.7526655869416803,{"$f":"_xlfn.CHISQ.DIST(A374,'Chi2-test af krydstabel'!$B$58,FALSE)","v":0.12545097458694748},"",""]
[1.7574674104675478,{"$f":"_xlfn.CHISQ.DIST(A375,'Chi2-test af krydstabel'!$B$58,FALSE)","v":0.12497905207242642},"",""]
[1.7622692339934154,{"$f":"_xlfn.CHISQ.DIST(A376,'Chi2-test af krydstabel'!$B$58,FALSE)","v":0.12450936958059486},"",""]
[1.767071057519283,{"$f":"_xlfn.CHISQ.DIST(A377,'Chi2-test af krydstabel'!$B$58,FALSE)","v":0.1240419126738561},"",""]
[1.7718728810451505,{"$f":"_xlfn.CHISQ.DIST(A378,'Chi2-test af krydstabel'!$B$58,FALSE)","v":0.12357666704252168},"",""]
[1.7766747045710181,{"$f":"_xlfn.CHISQ.DIST(A379,'Chi2-test af krydstabel'!$B$58,FALSE)","v":0.12311361850332297},"",""]
[1.7814765280968856,{"$f":"_xlfn.CHISQ.DIST(A380,'Chi2-test af krydstabel'!$B$58,FALSE)","v":0.12265275299794422},"",""]
[1.7862783516227532,{"$f":"_xlfn.CHISQ.DIST(A381,'Chi2-test af krydstabel'!$B$58,FALSE)","v":0.1221940565915767},"",""]
[1.7910801751486207,{"$f":"_xlfn.CHISQ.DIST(A382,'Chi2-test af krydstabel'!$B$58,FALSE)","v":0.12173751547149368},"",""]
[1.7958819986744883,{"$f":"_xlfn.CHISQ.DIST(A383,'Chi2-test af krydstabel'!$B$58,FALSE)","v":0.12128311594564575},"",""]
[1.8006838222003558,{"$f":"_xlfn.CHISQ.DIST(A384,'Chi2-test af krydstabel'!$B$58,FALSE)","v":0.12083084444127641},"",""]
[1.8054856457262234,{"$f":"_xlfn.CHISQ.DIST(A385,'Chi2-test af krydstabel'!$B$58,FALSE)","v":0.12038068750355711},"",""]
[1.8102874692520909,{"$f":"_xlfn.CHISQ.DIST(A386,'Chi2-test af krydstabel'!$B$58,FALSE)","v":0.11993263179424191},"",""]
[1.8150892927779585,{"$f":"_xlfn.CHISQ.DIST(A387,'Chi2-test af krydstabel'!$B$58,FALSE)","v":0.11948666409034114},"",""]
[1.8198911163038261,{"$f":"_xlfn.CHISQ.DIST(A388,'Chi2-test af krydstabel'!$B$58,FALSE)","v":0.11904277128281376},"",""]
[1.8246929398296936,{"$f":"_xlfn.CHISQ.DIST(A389,'Chi2-test af krydstabel'!$B$58,FALSE)","v":0.11860094037527817},"",""]
[1.8294947633555612,{"$f":"_xlfn.CHISQ.DIST(A390,'Chi2-test af krydstabel'!$B$58,FALSE)","v":0.11816115848274117},"",""]
[1.8342965868814287,{"$f":"_xlfn.CHISQ.DIST(A391,'Chi2-test af krydstabel'!$B$58,FALSE)","v":0.11772341283034476},"",""]
[1.8390984104072963,{"$f":"_xlfn.CHISQ.DIST(A392,'Chi2-test af krydstabel'!$B$58,FALSE)","v":0.11728769075213046},"",""]
[1.8439002339331638,{"$f":"_xlfn.CHISQ.DIST(A393,'Chi2-test af krydstabel'!$B$58,FALSE)","v":0.11685397968982064},{"$f":"IF($A393<$D$3,IF($A394>$D$3,MAX($B$9:$B$1009),\"\"),\"\")","v":""},{"$f":"IF($A393<$D$4,IF($A394>$D$4,MAX($B$9:$B$1009),\"\"),\"\")","v":""}]
[{"$f":"+A393+$B$4","v":1.8487020574590314},{"$f":"_xlfn.CHISQ.DIST(A394,'Chi2-test af krydstabel'!$B$58,FALSE)","v":0.11642226719161723},"",""]
[1.8535038809848989,{"$f":"_xlfn.CHISQ.DIST(A395,'Chi2-test af krydstabel'!$B$58,FALSE)","v":0.11599254091101661},"",""]
[1.8583057045107665,{"$f":"_xlfn.CHISQ.DIST(A396,'Chi2-test af krydstabel'!$B$58,FALSE)","v":0.11556478860564132},"",""]
[1.863107528036634,{"$f":"_xlfn.CHISQ.DIST(A397,'Chi2-test af krydstabel'!$B$58,FALSE)","v":0.11513899813608751},"",""]
[1.8679093515625016,{"$f":"_xlfn.CHISQ.DIST(A398,'Chi2-test af krydstabel'!$B$58,FALSE)","v":0.11471515746478855},"",""]
[1.8727111750883692,{"$f":"_xlfn.CHISQ.DIST(A399,'Chi2-test af krydstabel'!$B$58,FALSE)","v":0.11429325465489402},"",""]
[1.8775129986142367,{"$f":"_xlfn.CHISQ.DIST(A400,'Chi2-test af krydstabel'!$B$58,FALSE)","v":0.1138732778691641},"",""]
[1.8823148221401043,{"$f":"_xlfn.CHISQ.DIST(A401,'Chi2-test af krydstabel'!$B$58,FALSE)","v":0.11345521536887915},"",""]
[1.8871166456659718,{"$f":"_xlfn.CHISQ.DIST(A402,'Chi2-test af krydstabel'!$B$58,FALSE)","v":0.11303905551276397},"",""]
[1.8919184691918394,{"$f":"_xlfn.CHISQ.DIST(A403,'Chi2-test af krydstabel'!$B$58,FALSE)","v":0.11262478675592677},"",""]
[1.8967202927177069,{"$f":"_xlfn.CHISQ.DIST(A404,'Chi2-test af krydstabel'!$B$58,FALSE)","v":0.11221239764881243},"",""]
[1.9015221162435745,{"$f":"_xlfn.CHISQ.DIST(A405,'Chi2-test af krydstabel'!$B$58,FALSE)","v":0.11180187683616999},"",""]
[1.906323939769442,{"$f":"_xlfn.CHISQ.DIST(A406,'Chi2-test af krydstabel'!$B$58,FALSE)","v":0.11139321305603397},"",""]
[1.9111257632953096,{"$f":"_xlfn.CHISQ.DIST(A407,'Chi2-test af krydstabel'!$B$58,FALSE)","v":0.11098639513871941},"",""]
[1.9159275868211771,{"$f":"_xlfn.CHISQ.DIST(A408,'Chi2-test af krydstabel'!$B$58,FALSE)","v":0.11058141200583028},"",""]
[1.9207294103470447,{"$f":"_xlfn.CHISQ.DIST(A409,'Chi2-test af krydstabel'!$B$58,FALSE)","v":0.11017825266928133},"",""]
[1.9255312338729123,{"$f":"_xlfn.CHISQ.DIST(A410,'Chi2-test af krydstabel'!$B$58,FALSE)","v":0.10977690623033273},"",""]
[1.9303330573987798,{"$f":"_xlfn.CHISQ.DIST(A411,'Chi2-test af krydstabel'!$B$58,FALSE)","v":0.10937736187863786},"",""]
[1.9351348809246474,{"$f":"_xlfn.CHISQ.DIST(A412,'Chi2-test af krydstabel'!$B$58,FALSE)","v":0.10897960889130334},"",""]
[1.9399367044505149,{"$f":"_xlfn.CHISQ.DIST(A413,'Chi2-test af krydstabel'!$B$58,FALSE)","v":0.10858363663196181},"",""]
[1.9447385279763825,{"$f":"_xlfn.CHISQ.DIST(A414,'Chi2-test af krydstabel'!$B$58,FALSE)","v":0.1081894345498568},"",""]
[1.94954035150225,{"$f":"_xlfn.CHISQ.DIST(A415,'Chi2-test af krydstabel'!$B$58,FALSE)","v":0.10779699217893962},"",""]
[1.9543421750281176,{"$f":"_xlfn.CHISQ.DIST(A416,'Chi2-test af krydstabel'!$B$58,FALSE)","v":0.10740629913697822},"",""]
[1.9591439985539851,{"$f":"_xlfn.CHISQ.DIST(A417,'Chi2-test af krydstabel'!$B$58,FALSE)","v":0.10701734512467753},"",""]
[1.9639458220798527,{"$f":"_xlfn.CHISQ.DIST(A418,'Chi2-test af krydstabel'!$B$58,FALSE)","v":0.10663011992481146},"",""]
[1.9687476456057202,{"$f":"_xlfn.CHISQ.DIST(A419,'Chi2-test af krydstabel'!$B$58,FALSE)","v":0.10624461340136618},"",""]
[1.9735494691315878,{"$f":"_xlfn.CHISQ.DIST(A420,'Chi2-test af krydstabel'!$B$58,FALSE)","v":0.10586081549869431},"",""]
[1.9783512926574554,{"$f":"_xlfn.CHISQ.DIST(A421,'Chi2-test af krydstabel'!$B$58,FALSE)","v":0.10547871624068035},"",""]
[1.9831531161833229,{"$f":"_xlfn.CHISQ.DIST(A422,'Chi2-test af krydstabel'!$B$58,FALSE)","v":0.10509830572991692},"",""]
[1.9879549397091905,{"$f":"_xlfn.CHISQ.DIST(A423,'Chi2-test af krydstabel'!$B$58,FALSE)","v":0.1047195741468912},"",""]
[1.992756763235058,{"$f":"_xlfn.CHISQ.DIST(A424,'Chi2-test af krydstabel'!$B$58,FALSE)","v":0.10434251174918228},"",""]
[1.9975585867609256,{"$f":"_xlfn.CHISQ.DIST(A425,'Chi2-test af krydstabel'!$B$58,FALSE)","v":0.10396710887066868},"",""]
[2.0023604102867933,{"$f":"_xlfn.CHISQ.DIST(A426,'Chi2-test af krydstabel'!$B$58,FALSE)","v":0.10359335592074584},"",""]
[2.0071622338126609,{"$f":"_xlfn.CHISQ.DIST(A427,'Chi2-test af krydstabel'!$B$58,FALSE)","v":0.10322124338355378},"",""]
[2.0119640573385285,{"$f":"_xlfn.CHISQ.DIST(A428,'Chi2-test af krydstabel'!$B$58,FALSE)","v":0.10285076181721457},"",""]
[2.016765880864396,{"$f":"_xlfn.CHISQ.DIST(A429,'Chi2-test af krydstabel'!$B$58,FALSE)","v":0.10248190185307948},"",""]
[2.0215677043902636,{"$f":"_xlfn.CHISQ.DIST(A430,'Chi2-test af krydstabel'!$B$58,FALSE)","v":0.10211465419498546},"",""]
[2.0263695279161311,{"$f":"_xlfn.CHISQ.DIST(A431,'Chi2-test af krydstabel'!$B$58,FALSE)","v":0.10174900961852139},"",""]
[2.0311713514419987,{"$f":"_xlfn.CHISQ.DIST(A432,'Chi2-test af krydstabel'!$B$58,FALSE)","v":0.10138495897030324},"",""]
[2.0359731749678662,{"$f":"_xlfn.CHISQ.DIST(A433,'Chi2-test af krydstabel'!$B$58,FALSE)","v":0.10102249316725857},"",""]
[2.0407749984937338,{"$f":"_xlfn.CHISQ.DIST(A434,'Chi2-test af krydstabel'!$B$58,FALSE)","v":0.10066160319591989},"",""]
[2.0455768220196013,{"$f":"_xlfn.CHISQ.DIST(A435,'Chi2-test af krydstabel'!$B$58,FALSE)","v":0.10030228011172686},"",""]
[2.0503786455454689,{"$f":"_xlfn.CHISQ.DIST(A436,'Chi2-test af krydstabel'!$B$58,FALSE)","v":9.9944515038337248E-2},"",""]
[2.0551804690713364,{"$f":"_xlfn.CHISQ.DIST(A437,'Chi2-test af krydstabel'!$B$58,FALSE)","v":9.958829916694642E-2},"",""]
[2.059982292597204,{"$f":"_xlfn.CHISQ.DIST(A438,'Chi2-test af krydstabel'!$B$58,FALSE)","v":9.9233623755615369E-2},"",""]
[2.0647841161230716,{"$f":"_xlfn.CHISQ.DIST(A439,'Chi2-test af krydstabel'!$B$58,FALSE)","v":9.8880480128606923E-2},"",""]
[2.0695859396489391,{"$f":"_xlfn.CHISQ.DIST(A440,'Chi2-test af krydstabel'!$B$58,FALSE)","v":9.8528859675730288E-2},"",""]
[2.0743877631748067,{"$f":"_xlfn.CHISQ.DIST(A441,'Chi2-test af krydstabel'!$B$58,FALSE)","v":9.817875385169364E-2},"",""]
[2.0791895867006742,{"$f":"_xlfn.CHISQ.DIST(A442,'Chi2-test af krydstabel'!$B$58,FALSE)","v":9.7830154175464618E-2},"",""]
[2.0839914102265418,{"$f":"_xlfn.CHISQ.DIST(A443,'Chi2-test af krydstabel'!$B$58,FALSE)","v":9.7483052229638739E-2},"",""]
[2.0887932337524093,{"$f":"_xlfn.CHISQ.DIST(A444,'Chi2-test af krydstabel'!$B$58,FALSE)","v":9.7137439659815542E-2},"",""]
[2.0935950572782769,{"$f":"_xlfn.CHISQ.DIST(A445,'Chi2-test af krydstabel'!$B$58,FALSE)","v":9.6793308173982212E-2},"",""]
[2.0983968808041444,{"$f":"_xlfn.CHISQ.DIST(A446,'Chi2-test af krydstabel'!$B$58,FALSE)","v":9.6450649541904951E-2},"",""]
[2.103198704330012,{"$f":"_xlfn.CHISQ.DIST(A447,'Chi2-test af krydstabel'!$B$58,FALSE)","v":9.6109455594527632E-2},"",""]
[2.1080005278558795,{"$f":"_xlfn.CHISQ.DIST(A448,'Chi2-test af krydstabel'!$B$58,FALSE)","v":9.5769718223377515E-2},"",""]
[2.1128023513817471,{"$f":"_xlfn.CHISQ.DIST(A449,'Chi2-test af krydstabel'!$B$58,FALSE)","v":9.5431429379978672E-2},"",""]
[2.1176041749076147,{"$f":"_xlfn.CHISQ.DIST(A450,'Chi2-test af krydstabel'!$B$58,FALSE)","v":9.5094581075271925E-2},"",""]
[2.1224059984334822,{"$f":"_xlfn.CHISQ.DIST(A451,'Chi2-test af krydstabel'!$B$58,FALSE)","v":9.4759165379042165E-2},"",""]
[2.1272078219593498,{"$f":"_xlfn.CHISQ.DIST(A452,'Chi2-test af krydstabel'!$B$58,FALSE)","v":9.4425174419352345E-2},"",""]
[2.1320096454852173,{"$f":"_xlfn.CHISQ.DIST(A453,'Chi2-test af krydstabel'!$B$58,FALSE)","v":9.4092600381984359E-2},"",""]
[2.1368114690110849,{"$f":"_xlfn.CHISQ.DIST(A454,'Chi2-test af krydstabel'!$B$58,FALSE)","v":9.3761435509886526E-2},"",""]
[2.1416132925369524,{"$f":"_xlfn.CHISQ.DIST(A455,'Chi2-test af krydstabel'!$B$58,FALSE)","v":9.3431672102627719E-2},"",""]
[2.14641511606282,{"$f":"_xlfn.CHISQ.DIST(A456,'Chi2-test af krydstabel'!$B$58,FALSE)","v":9.3103302515857897E-2},"",""]
[2.1512169395886875,{"$f":"_xlfn.CHISQ.DIST(A457,'Chi2-test af krydstabel'!$B$58,FALSE)","v":9.2776319160775278E-2},{"$f":"IF($A457<$D$3,IF($A458>$D$3,MAX($B$9:$B$1009),\"\"),\"\")","v":""},{"$f":"IF($A457<$D$4,IF($A458>$D$4,MAX($B$9:$B$1009),\"\"),\"\")","v":""}]
[{"$f":"+A457+$B$4","v":2.1560187631145551},{"$f":"_xlfn.CHISQ.DIST(A458,'Chi2-test af krydstabel'!$B$58,FALSE)","v":9.2450714503599429E-2},"",""]
[2.1608205866404226,{"$f":"_xlfn.CHISQ.DIST(A459,'Chi2-test af krydstabel'!$B$58,FALSE)","v":9.2126481065050989E-2},"",""]
[2.1656224101662902,{"$f":"_xlfn.CHISQ.DIST(A460,'Chi2-test af krydstabel'!$B$58,FALSE)","v":9.1803611419837158E-2},"",""]
[2.1704242336921578,{"$f":"_xlfn.CHISQ.DIST(A461,'Chi2-test af krydstabel'!$B$58,FALSE)","v":9.1482098196143641E-2},"",""]
[2.1752260572180253,{"$f":"_xlfn.CHISQ.DIST(A462,'Chi2-test af krydstabel'!$B$58,FALSE)","v":9.1161934075132081E-2},"",""]
[2.1800278807438929,{"$f":"_xlfn.CHISQ.DIST(A463,'Chi2-test af krydstabel'!$B$58,FALSE)","v":9.084311179044384E-2},"",""]
[2.1848297042697604,{"$f":"_xlfn.CHISQ.DIST(A464,'Chi2-test af krydstabel'!$B$58,FALSE)","v":9.0525624127709106E-2},"",""]
[2.189631527795628,{"$f":"_xlfn.CHISQ.DIST(A465,'Chi2-test af krydstabel'!$B$58,FALSE)","v":9.0209463924062247E-2},"",""]
[2.1944333513214955,{"$f":"_xlfn.CHISQ.DIST(A466,'Chi2-test af krydstabel'!$B$58,FALSE)","v":8.9894624067662271E-2},"",""]
[2.1992351748473631,{"$f":"_xlfn.CHISQ.DIST(A467,'Chi2-test af krydstabel'!$B$58,FALSE)","v":8.9581097497219223E-2},"",""]
[2.2040369983732306,{"$f":"_xlfn.CHISQ.DIST(A468,'Chi2-test af krydstabel'!$B$58,FALSE)","v":8.926887720152589E-2},"",""]
[2.2088388218990982,{"$f":"_xlfn.CHISQ.DIST(A469,'Chi2-test af krydstabel'!$B$58,FALSE)","v":8.8957956218994952E-2},"",""]
[2.2136406454249657,{"$f":"_xlfn.CHISQ.DIST(A470,'Chi2-test af krydstabel'!$B$58,FALSE)","v":8.8648327637201443E-2},"",""]
[2.2184424689508333,{"$f":"_xlfn.CHISQ.DIST(A471,'Chi2-test af krydstabel'!$B$58,FALSE)","v":8.8339984592430601E-2},"",""]
[2.2232442924767009,{"$f":"_xlfn.CHISQ.DIST(A472,'Chi2-test af krydstabel'!$B$58,FALSE)","v":8.8032920269230541E-2},"",""]
[2.2280461160025684,{"$f":"_xlfn.CHISQ.DIST(A473,'Chi2-test af krydstabel'!$B$58,FALSE)","v":8.7727127899970614E-2},"",""]
[2.232847939528436,{"$f":"_xlfn.CHISQ.DIST(A474,'Chi2-test af krydstabel'!$B$58,FALSE)","v":8.7422600764404182E-2},"",""]
[2.2376497630543035,{"$f":"_xlfn.CHISQ.DIST(A475,'Chi2-test af krydstabel'!$B$58,FALSE)","v":8.7119332189236884E-2},"",""]
[2.2424515865801711,{"$f":"_xlfn.CHISQ.DIST(A476,'Chi2-test af krydstabel'!$B$58,FALSE)","v":8.6817315547699517E-2},"",""]
[2.2472534101060386,{"$f":"_xlfn.CHISQ.DIST(A477,'Chi2-test af krydstabel'!$B$58,FALSE)","v":8.6516544259125819E-2},"",""]
[2.2520552336319062,{"$f":"_xlfn.CHISQ.DIST(A478,'Chi2-test af krydstabel'!$B$58,FALSE)","v":8.6217011788535108E-2},"",""]
[2.2568570571577737,{"$f":"_xlfn.CHISQ.DIST(A479,'Chi2-test af krydstabel'!$B$58,FALSE)","v":8.5918711646219531E-2},"",""]
[2.2616588806836413,{"$f":"_xlfn.CHISQ.DIST(A480,'Chi2-test af krydstabel'!$B$58,FALSE)","v":8.5621637387335955E-2},"",""]
[2.2664607042095088,{"$f":"_xlfn.CHISQ.DIST(A481,'Chi2-test af krydstabel'!$B$58,FALSE)","v":8.5325782611502615E-2},"",""]
[2.2712625277353764,{"$f":"_xlfn.CHISQ.DIST(A482,'Chi2-test af krydstabel'!$B$58,FALSE)","v":8.5031140962399984E-2},"",""]
[2.276064351261244,{"$f":"_xlfn.CHISQ.DIST(A483,'Chi2-test af krydstabel'!$B$58,FALSE)","v":8.473770612737648E-2},"",""]
[2.2808661747871115,{"$f":"_xlfn.CHISQ.DIST(A484,'Chi2-test af krydstabel'!$B$58,FALSE)","v":8.4445471837058139E-2},"",""]
[2.2856679983129791,{"$f":"_xlfn.CHISQ.DIST(A485,'Chi2-test af krydstabel'!$B$58,FALSE)","v":8.4154431864963117E-2},"",""]
[2.2904698218388466,{"$f":"_xlfn.CHISQ.DIST(A486,'Chi2-test af krydstabel'!$B$58,FALSE)","v":8.3864580027119995E-2},"",""]
[2.2952716453647142,{"$f":"_xlfn.CHISQ.DIST(A487,'Chi2-test af krydstabel'!$B$58,FALSE)","v":8.3575910181690694E-2},"",""]
[2.3000734688905817,{"$f":"_xlfn.CHISQ.DIST(A488,'Chi2-test af krydstabel'!$B$58,FALSE)","v":8.3288416228597367E-2},"",""]
[2.3048752924164493,{"$f":"_xlfn.CHISQ.DIST(A489,'Chi2-test af krydstabel'!$B$58,FALSE)","v":8.3002092109153464E-2},"",""]
[2.3096771159423168,{"$f":"_xlfn.CHISQ.DIST(A490,'Chi2-test af krydstabel'!$B$58,FALSE)","v":8.2716931805698793E-2},"",""]
[2.3144789394681844,{"$f":"_xlfn.CHISQ.DIST(A491,'Chi2-test af krydstabel'!$B$58,FALSE)","v":8.2432929341238775E-2},"",""]
[2.3192807629940519,{"$f":"_xlfn.CHISQ.DIST(A492,'Chi2-test af krydstabel'!$B$58,FALSE)","v":8.2150078779087379E-2},"",""]
[2.3240825865199195,{"$f":"_xlfn.CHISQ.DIST(A493,'Chi2-test af krydstabel'!$B$58,FALSE)","v":8.1868374222514223E-2},"",""]
[2.3288844100457871,{"$f":"_xlfn.CHISQ.DIST(A494,'Chi2-test af krydstabel'!$B$58,FALSE)","v":8.1587809814395368E-2},"",""]
[2.3336862335716546,{"$f":"_xlfn.CHISQ.DIST(A495,'Chi2-test af krydstabel'!$B$58,FALSE)","v":8.1308379736867956E-2},"",""]
[2.3384880570975222,{"$f":"_xlfn.CHISQ.DIST(A496,'Chi2-test af krydstabel'!$B$58,FALSE)","v":8.1030078210988704E-2},"",""]
[2.3432898806233897,{"$f":"_xlfn.CHISQ.DIST(A497,'Chi2-test af krydstabel'!$B$58,FALSE)","v":8.0752899496395886E-2},"",""]
[2.3480917041492573,{"$f":"_xlfn.CHISQ.DIST(A498,'Chi2-test af krydstabel'!$B$58,FALSE)","v":8.0476837890975109E-2},"",""]
[2.3528935276751248,{"$f":"_xlfn.CHISQ.DIST(A499,'Chi2-test af krydstabel'!$B$58,FALSE)","v":8.0201887730528845E-2},"",""]
[2.3576953512009924,{"$f":"_xlfn.CHISQ.DIST(A500,'Chi2-test af krydstabel'!$B$58,FALSE)","v":7.9928043388449152E-2},"",""]
[2.3624971747268599,{"$f":"_xlfn.CHISQ.DIST(A501,'Chi2-test af krydstabel'!$B$58,FALSE)","v":7.9655299275394248E-2},"",""]
[2.3672989982527275,{"$f":"_xlfn.CHISQ.DIST(A502,'Chi2-test af krydstabel'!$B$58,FALSE)","v":7.9383649838968479E-2},"",""]
[2.372100821778595,{"$f":"_xlfn.CHISQ.DIST(A503,'Chi2-test af krydstabel'!$B$58,FALSE)","v":7.9113089563405542E-2},"",""]
[2.3769026453044626,{"$f":"_xlfn.CHISQ.DIST(A504,'Chi2-test af krydstabel'!$B$58,FALSE)","v":7.8843612969255294E-2},"",""]
[2.3817044688303302,{"$f":"_xlfn.CHISQ.DIST(A505,'Chi2-test af krydstabel'!$B$58,FALSE)","v":7.8575214613073818E-2},"",""]
[2.3865062923561977,{"$f":"_xlfn.CHISQ.DIST(A506,'Chi2-test af krydstabel'!$B$58,FALSE)","v":7.8307889087116861E-2},"",""]
[2.3913081158820653,{"$f":"_xlfn.CHISQ.DIST(A507,'Chi2-test af krydstabel'!$B$58,FALSE)","v":7.8041631019036342E-2},"",""]
[2.3961099394079328,{"$f":"_xlfn.CHISQ.DIST(A508,'Chi2-test af krydstabel'!$B$58,FALSE)","v":7.777643507158026E-2},"",""]
[2.4009117629338004,{"$f":"_xlfn.CHISQ.DIST(A509,'Chi2-test af krydstabel'!$B$58,FALSE)","v":7.7512295942295723E-2},"",""]
[2.4057135864596679,{"$f":"_xlfn.CHISQ.DIST(A510,'Chi2-test af krydstabel'!$B$58,FALSE)","v":7.7249208363235095E-2},"",""]
[2.4105154099855355,{"$f":"_xlfn.CHISQ.DIST(A511,'Chi2-test af krydstabel'!$B$58,FALSE)","v":7.6987167100665166E-2},"",""]
[2.415317233511403,{"$f":"_xlfn.CHISQ.DIST(A512,'Chi2-test af krydstabel'!$B$58,FALSE)","v":7.6726166954779546E-2},"",""]
[2.4201190570372706,{"$f":"_xlfn.CHISQ.DIST(A513,'Chi2-test af krydstabel'!$B$58,FALSE)","v":7.6466202759413932E-2},"",""]
[2.4249208805631381,{"$f":"_xlfn.CHISQ.DIST(A514,'Chi2-test af krydstabel'!$B$58,FALSE)","v":7.6207269381764406E-2},"",""]
[2.4297227040890057,{"$f":"_xlfn.CHISQ.DIST(A515,'Chi2-test af krydstabel'!$B$58,FALSE)","v":7.5949361722108658E-2},"",""]
[2.4345245276148733,{"$f":"_xlfn.CHISQ.DIST(A516,'Chi2-test af krydstabel'!$B$58,FALSE)","v":7.5692474713530106E-2},"",""]
[2.4393263511407408,{"$f":"_xlfn.CHISQ.DIST(A517,'Chi2-test af krydstabel'!$B$58,FALSE)","v":7.5436603321644993E-2},"",""]
[2.4441281746666084,{"$f":"_xlfn.CHISQ.DIST(A518,'Chi2-test af krydstabel'!$B$58,FALSE)","v":7.5181742544332089E-2},"",""]
[2.4489299981924759,{"$f":"_xlfn.CHISQ.DIST(A519,'Chi2-test af krydstabel'!$B$58,FALSE)","v":7.4927887411465388E-2},"",""]
[2.4537318217183435,{"$f":"_xlfn.CHISQ.DIST(A520,'Chi2-test af krydstabel'!$B$58,FALSE)","v":7.4675032984649531E-2},"",""]
[2.458533645244211,{"$f":"_xlfn.CHISQ.DIST(A521,'Chi2-test af krydstabel'!$B$58,FALSE)","v":7.4423174356957902E-2},{"$f":"IF($A521<$D$3,IF($A522>$D$3,MAX($B$9:$B$1009),\"\"),\"\")","v":""},{"$f":"IF($A521<$D$4,IF($A522>$D$4,MAX($B$9:$B$1009),\"\"),\"\")","v":""}]
[{"$f":"+A521+$B$4","v":2.4633354687700786},{"$f":"_xlfn.CHISQ.DIST(A522,'Chi2-test af krydstabel'!$B$58,FALSE)","v":7.4172306652673436E-2},"",""]
[2.4681372922959461,{"$f":"_xlfn.CHISQ.DIST(A523,'Chi2-test af krydstabel'!$B$58,FALSE)","v":7.3922425027032113E-2},"",""]
[2.4729391158218137,{"$f":"_xlfn.CHISQ.DIST(A524,'Chi2-test af krydstabel'!$B$58,FALSE)","v":7.3673524665969062E-2},"",""]
[2.4777409393476812,{"$f":"_xlfn.CHISQ.DIST(A525,'Chi2-test af krydstabel'!$B$58,FALSE)","v":7.3425600785867254E-2},"",""]
[2.4825427628735488,{"$f":"_xlfn.CHISQ.DIST(A526,'Chi2-test af krydstabel'!$B$58,FALSE)","v":7.3178648633308779E-2},"",""]
[2.4873445863994164,{"$f":"_xlfn.CHISQ.DIST(A527,'Chi2-test af krydstabel'!$B$58,FALSE)","v":7.2932663484828644E-2},"",""]
[2.4921464099252839,{"$f":"_xlfn.CHISQ.DIST(A528,'Chi2-test af krydstabel'!$B$58,FALSE)","v":7.2687640646671103E-2},"",""]
[2.4969482334511515,{"$f":"_xlfn.CHISQ.DIST(A529,'Chi2-test af krydstabel'!$B$58,FALSE)","v":7.2443575454548409E-2},"",""]
[2.501750056977019,{"$f":"_xlfn.CHISQ.DIST(A530,'Chi2-test af krydstabel'!$B$58,FALSE)","v":7.2200463273401988E-2},"",""]
[2.5065518805028866,{"$f":"_xlfn.CHISQ.DIST(A531,'Chi2-test af krydstabel'!$B$58,FALSE)","v":7.1958299497166131E-2},"",""]
[2.5113537040287541,{"$f":"_xlfn.CHISQ.DIST(A532,'Chi2-test af krydstabel'!$B$58,FALSE)","v":7.1717079548534027E-2},"",""]
[2.5161555275546217,{"$f":"_xlfn.CHISQ.DIST(A533,'Chi2-test af krydstabel'!$B$58,FALSE)","v":7.1476798878726003E-2},"",""]
[2.5209573510804892,{"$f":"_xlfn.CHISQ.DIST(A534,'Chi2-test af krydstabel'!$B$58,FALSE)","v":7.1237452967260362E-2},"",""]
[2.5257591746063568,{"$f":"_xlfn.CHISQ.DIST(A535,'Chi2-test af krydstabel'!$B$58,FALSE)","v":7.0999037321726285E-2},"",""]
[2.5305609981322243,{"$f":"_xlfn.CHISQ.DIST(A536,'Chi2-test af krydstabel'!$B$58,FALSE)","v":7.0761547477559111E-2},"",""]
[2.5353628216580919,{"$f":"_xlfn.CHISQ.DIST(A537,'Chi2-test af krydstabel'!$B$58,FALSE)","v":7.052497899781783E-2},"",""]
[2.5401646451839595,{"$f":"_xlfn.CHISQ.DIST(A538,'Chi2-test af krydstabel'!$B$58,FALSE)","v":7.0289327472964819E-2},"",""]
[2.544966468709827,{"$f":"_xlfn.CHISQ.DIST(A539,'Chi2-test af krydstabel'!$B$58,FALSE)","v":7.0054588520647748E-2},"",""]
[2.5497682922356946,{"$f":"_xlfn.CHISQ.DIST(A540,'Chi2-test af krydstabel'!$B$58,FALSE)","v":6.9820757785483648E-2},"",""]
[2.5545701157615621,{"$f":"_xlfn.CHISQ.DIST(A541,'Chi2-test af krydstabel'!$B$58,FALSE)","v":6.9587830938845047E-2},"",""]
[2.5593719392874297,{"$f":"_xlfn.CHISQ.DIST(A542,'Chi2-test af krydstabel'!$B$58,FALSE)","v":6.9355803678648437E-2},"",""]
[2.5641737628132972,{"$f":"_xlfn.CHISQ.DIST(A543,'Chi2-test af krydstabel'!$B$58,FALSE)","v":6.9124671729144563E-2},"",""]
[2.5689755863391648,{"$f":"_xlfn.CHISQ.DIST(A544,'Chi2-test af krydstabel'!$B$58,FALSE)","v":6.8894430840710938E-2},"",""]
[2.5737774098650323,{"$f":"_xlfn.CHISQ.DIST(A545,'Chi2-test af krydstabel'!$B$58,FALSE)","v":6.866507678964634E-2},"",""]
[2.5785792333908999,{"$f":"_xlfn.CHISQ.DIST(A546,'Chi2-test af krydstabel'!$B$58,FALSE)","v":6.8436605377967336E-2},"",""]
[2.5833810569167674,{"$f":"_xlfn.CHISQ.DIST(A547,'Chi2-test af krydstabel'!$B$58,FALSE)","v":6.8209012433206831E-2},"",""]
[2.588182880442635,{"$f":"_xlfn.CHISQ.DIST(A548,'Chi2-test af krydstabel'!$B$58,FALSE)","v":6.7982293808214481E-2},"",""]
[2.5929847039685026,{"$f":"_xlfn.CHISQ.DIST(A549,'Chi2-test af krydstabel'!$B$58,FALSE)","v":6.7756445380959179E-2},"",""]
[2.5977865274943701,{"$f":"_xlfn.CHISQ.DIST(A550,'Chi2-test af krydstabel'!$B$58,FALSE)","v":6.7531463054333371E-2},"",""]
[2.6025883510202377,{"$f":"_xlfn.CHISQ.DIST(A551,'Chi2-test af krydstabel'!$B$58,FALSE)","v":6.7307342755959315E-2},"",""]
[2.6073901745461052,{"$f":"_xlfn.CHISQ.DIST(A552,'Chi2-test af krydstabel'!$B$58,FALSE)","v":6.7084080437997184E-2},"",""]
[2.6121919980719728,{"$f":"_xlfn.CHISQ.DIST(A553,'Chi2-test af krydstabel'!$B$58,FALSE)","v":6.6861672076955092E-2},"",""]
[2.6169938215978403,{"$f":"_xlfn.CHISQ.DIST(A554,'Chi2-test af krydstabel'!$B$58,FALSE)","v":6.6640113673500853E-2},"",""]
[2.6217956451237079,{"$f":"_xlfn.CHISQ.DIST(A555,'Chi2-test af krydstabel'!$B$58,FALSE)","v":6.6419401252275606E-2},"",""]
[2.6265974686495754,{"$f":"_xlfn.CHISQ.DIST(A556,'Chi2-test af krydstabel'!$B$58,FALSE)","v":6.6199530861709266E-2},"",""]
[2.631399292175443,{"$f":"_xlfn.CHISQ.DIST(A557,'Chi2-test af krydstabel'!$B$58,FALSE)","v":6.5980498573837726E-2},"",""]
[2.6362011157013105,{"$f":"_xlfn.CHISQ.DIST(A558,'Chi2-test af krydstabel'!$B$58,FALSE)","v":6.5762300484121725E-2},"",""]
[2.6410029392271781,{"$f":"_xlfn.CHISQ.DIST(A559,'Chi2-test af krydstabel'!$B$58,FALSE)","v":6.5544932711267587E-2},"",""]
[2.6458047627530457,{"$f":"_xlfn.CHISQ.DIST(A560,'Chi2-test af krydstabel'!$B$58,FALSE)","v":6.5328391397049532E-2},"",""]
[2.6506065862789132,{"$f":"_xlfn.CHISQ.DIST(A561,'Chi2-test af krydstabel'!$B$58,FALSE)","v":6.5112672706133815E-2},"",""]
[2.6554084098047808,{"$f":"_xlfn.CHISQ.DIST(A562,'Chi2-test af krydstabel'!$B$58,FALSE)","v":6.4897772825904421E-2},"",""]
[2.6602102333306483,{"$f":"_xlfn.CHISQ.DIST(A563,'Chi2-test af krydstabel'!$B$58,FALSE)","v":6.4683687966290454E-2},"",""]
[2.6650120568565159,{"$f":"_xlfn.CHISQ.DIST(A564,'Chi2-test af krydstabel'!$B$58,FALSE)","v":6.4470414359595191E-2},"",""]
[2.6698138803823834,{"$f":"_xlfn.CHISQ.DIST(A565,'Chi2-test af krydstabel'!$B$58,FALSE)","v":6.4257948260326755E-2},"",""]
[2.674615703908251,{"$f":"_xlfn.CHISQ.DIST(A566,'Chi2-test af krydstabel'!$B$58,FALSE)","v":6.4046285945030257E-2},"",""]
[2.6794175274341185,{"$f":"_xlfn.CHISQ.DIST(A567,'Chi2-test af krydstabel'!$B$58,FALSE)","v":6.3835423712121683E-2},"",""]
[2.6842193509599861,{"$f":"_xlfn.CHISQ.DIST(A568,'Chi2-test af krydstabel'!$B$58,FALSE)","v":6.3625357881723313E-2},"",""]
[2.6890211744858536,{"$f":"_xlfn.CHISQ.DIST(A569,'Chi2-test af krydstabel'!$B$58,FALSE)","v":6.3416084795500538E-2},"",""]
[2.6938229980117212,{"$f":"_xlfn.CHISQ.DIST(A570,'Chi2-test af krydstabel'!$B$58,FALSE)","v":6.320760081650037E-2},"",""]
[2.6986248215375888,{"$f":"_xlfn.CHISQ.DIST(A571,'Chi2-test af krydstabel'!$B$58,FALSE)","v":6.2999902328991442E-2},"",""]
[2.7034266450634563,{"$f":"_xlfn.CHISQ.DIST(A572,'Chi2-test af krydstabel'!$B$58,FALSE)","v":6.2792985738305329E-2},"",""]
[2.7082284685893239,{"$f":"_xlfn.CHISQ.DIST(A573,'Chi2-test af krydstabel'!$B$58,FALSE)","v":6.2586847470679649E-2},"",""]
[2.7130302921151914,{"$f":"_xlfn.CHISQ.DIST(A574,'Chi2-test af krydstabel'!$B$58,FALSE)","v":6.2381483973102322E-2},"",""]
[2.717832115641059,{"$f":"_xlfn.CHISQ.DIST(A575,'Chi2-test af krydstabel'!$B$58,FALSE)","v":6.2176891713157406E-2},"",""]
[2.7226339391669265,{"$f":"_xlfn.CHISQ.DIST(A576,'Chi2-test af krydstabel'!$B$58,FALSE)","v":6.1973067178872375E-2},"",""]
[2.7274357626927941,{"$f":"_xlfn.CHISQ.DIST(A577,'Chi2-test af krydstabel'!$B$58,FALSE)","v":6.1770006878566805E-2},"",""]
[2.7322375862186616,{"$f":"_xlfn.CHISQ.DIST(A578,'Chi2-test af krydstabel'!$B$58,FALSE)","v":6.156770734070241E-2},"",""]
[2.7370394097445292,{"$f":"_xlfn.CHISQ.DIST(A579,'Chi2-test af krydstabel'!$B$58,FALSE)","v":6.1366165113734467E-2},"",""]
[2.7418412332703967,{"$f":"_xlfn.CHISQ.DIST(A580,'Chi2-test af krydstabel'!$B$58,FALSE)","v":6.1165376765964632E-2},"",""]
[2.7466430567962643,{"$f":"_xlfn.CHISQ.DIST(A581,'Chi2-test af krydstabel'!$B$58,FALSE)","v":6.0965338885395126E-2},"",""]
[2.7514448803221319,{"$f":"_xlfn.CHISQ.DIST(A582,'Chi2-test af krydstabel'!$B$58,FALSE)","v":6.0766048079584148E-2},"",""]
[2.7562467038479994,{"$f":"_xlfn.CHISQ.DIST(A583,'Chi2-test af krydstabel'!$B$58,FALSE)","v":6.0567500975502772E-2},"",""]
[2.761048527373867,{"$f":"_xlfn.CHISQ.DIST(A584,'Chi2-test af krydstabel'!$B$58,FALSE)","v":6.0369694219392957E-2},"",""]
[2.7658503508997345,{"$f":"_xlfn.CHISQ.DIST(A585,'Chi2-test af krydstabel'!$B$58,FALSE)","v":6.0172624476627058E-2},{"$f":"IF($A585<$D$3,IF($A586>$D$3,MAX($B$9:$B$1009),\"\"),\"\")","v":""},{"$f":"IF($A585<$D$4,IF($A586>$D$4,MAX($B$9:$B$1009),\"\"),\"\")","v":""}]
[{"$f":"+A585+$B$4","v":2.7706521744256021},{"$f":"_xlfn.CHISQ.DIST(A586,'Chi2-test af krydstabel'!$B$58,FALSE)","v":5.9976288431568416E-2},"",""]
[2.7754539979514696,{"$f":"_xlfn.CHISQ.DIST(A587,'Chi2-test af krydstabel'!$B$58,FALSE)","v":5.978068278743337E-2},"",""]
[2.7802558214773372,{"$f":"_xlfn.CHISQ.DIST(A588,'Chi2-test af krydstabel'!$B$58,FALSE)","v":5.9585804266154424E-2},"",""]
[2.7850576450032047,{"$f":"_xlfn.CHISQ.DIST(A589,'Chi2-test af krydstabel'!$B$58,FALSE)","v":5.9391649608244612E-2},"",""]
[2.7898594685290723,{"$f":"_xlfn.CHISQ.DIST(A590,'Chi2-test af krydstabel'!$B$58,FALSE)","v":5.9198215572663304E-2},"",""]
[2.7946612920549398,{"$f":"_xlfn.CHISQ.DIST(A591,'Chi2-test af krydstabel'!$B$58,FALSE)","v":5.9005498936682901E-2},"",""]
[2.7994631155808074,{"$f":"_xlfn.CHISQ.DIST(A592,'Chi2-test af krydstabel'!$B$58,FALSE)","v":5.8813496495756977E-2},"",""]
[2.804264939106675,{"$f":"_xlfn.CHISQ.DIST(A593,'Chi2-test af krydstabel'!$B$58,FALSE)","v":5.8622205063389513E-2},"",""]
[2.8090667626325425,{"$f":"_xlfn.CHISQ.DIST(A594,'Chi2-test af krydstabel'!$B$58,FALSE)","v":5.8431621471005314E-2},"",""]
[2.8138685861584101,{"$f":"_xlfn.CHISQ.DIST(A595,'Chi2-test af krydstabel'!$B$58,FALSE)","v":5.8241742567821476E-2},"",""]
[2.8186704096842776,{"$f":"_xlfn.CHISQ.DIST(A596,'Chi2-test af krydstabel'!$B$58,FALSE)","v":5.8052565220720324E-2},"",""]
[2.8234722332101452,{"$f":"_xlfn.CHISQ.DIST(A597,'Chi2-test af krydstabel'!$B$58,FALSE)","v":5.7864086314122987E-2},"",""]
[2.8282740567360127,{"$f":"_xlfn.CHISQ.DIST(A598,'Chi2-test af krydstabel'!$B$58,FALSE)","v":5.7676302749864558E-2},"",""]
[2.8330758802618803,{"$f":"_xlfn.CHISQ.DIST(A599,'Chi2-test af krydstabel'!$B$58,FALSE)","v":5.7489211447070074E-2},"",""]
[2.8378777037877478,{"$f":"_xlfn.CHISQ.DIST(A600,'Chi2-test af krydstabel'!$B$58,FALSE)","v":5.7302809342031774E-2},"",""]
[2.8426795273136154,{"$f":"_xlfn.CHISQ.DIST(A601,'Chi2-test af krydstabel'!$B$58,FALSE)","v":5.7117093388087251E-2},"",""]
[2.8474813508394829,{"$f":"_xlfn.CHISQ.DIST(A602,'Chi2-test af krydstabel'!$B$58,FALSE)","v":5.6932060555498862E-2},"",""]
[2.8522831743653505,{"$f":"_xlfn.CHISQ.DIST(A603,'Chi2-test af krydstabel'!$B$58,FALSE)","v":5.67477078313341E-2},"",""]
[2.8570849978912181,{"$f":"_xlfn.CHISQ.DIST(A604,'Chi2-test af krydstabel'!$B$58,FALSE)","v":5.6564032219347062E-2},"",""]
[2.8618868214170856,{"$f":"_xlfn.CHISQ.DIST(A605,'Chi2-test af krydstabel'!$B$58,FALSE)","v":5.638103073986088E-2},"",""]
[2.8666886449429532,{"$f":"_xlfn.CHISQ.DIST(A606,'Chi2-test af krydstabel'!$B$58,FALSE)","v":5.6198700429651298E-2},"",""]
[2.8714904684688207,{"$f":"_xlfn.CHISQ.DIST(A607,'Chi2-test af krydstabel'!$B$58,FALSE)","v":5.6017038341831187E-2},"",""]
[2.8762922919946883,{"$f":"_xlfn.CHISQ.DIST(A608,'Chi2-test af krydstabel'!$B$58,FALSE)","v":5.5836041545736063E-2},"",""]
[2.8810941155205558,{"$f":"_xlfn.CHISQ.DIST(A609,'Chi2-test af krydstabel'!$B$58,FALSE)","v":5.5655707126810672E-2},"",""]
[2.8858959390464234,{"$f":"_xlfn.CHISQ.DIST(A610,'Chi2-test af krydstabel'!$B$58,FALSE)","v":5.5476032186496493E-2},"",""]
[2.8906977625722909,{"$f":"_xlfn.CHISQ.DIST(A611,'Chi2-test af krydstabel'!$B$58,FALSE)","v":5.5297013842120234E-2},"",""]
[2.8954995860981585,{"$f":"_xlfn.CHISQ.DIST(A612,'Chi2-test af krydstabel'!$B$58,FALSE)","v":5.5118649226783327E-2},"",""]
[2.900301409624026,{"$f":"_xlfn.CHISQ.DIST(A613,'Chi2-test af krydstabel'!$B$58,FALSE)","v":5.4940935489252295E-2},"",""]
[2.9051032331498936,{"$f":"_xlfn.CHISQ.DIST(A614,'Chi2-test af krydstabel'!$B$58,FALSE)","v":5.4763869793850235E-2},"",""]
[2.9099050566757612,{"$f":"_xlfn.CHISQ.DIST(A615,'Chi2-test af krydstabel'!$B$58,FALSE)","v":5.4587449320349007E-2},"",""]
[2.9147068802016287,{"$f":"_xlfn.CHISQ.DIST(A616,'Chi2-test af krydstabel'!$B$58,FALSE)","v":5.4411671263862552E-2},"",""]
[2.9195087037274963,{"$f":"_xlfn.CHISQ.DIST(A617,'Chi2-test af krydstabel'!$B$58,FALSE)","v":5.4236532834741009E-2},"",""]
[2.9243105272533638,{"$f":"_xlfn.CHISQ.DIST(A618,'Chi2-test af krydstabel'!$B$58,FALSE)","v":5.4062031258465759E-2},"",""]
[2.9291123507792314,{"$f":"_xlfn.CHISQ.DIST(A619,'Chi2-test af krydstabel'!$B$58,FALSE)","v":5.3888163775545471E-2},"",""]
[2.9339141743050989,{"$f":"_xlfn.CHISQ.DIST(A620,'Chi2-test af krydstabel'!$B$58,FALSE)","v":5.3714927641412821E-2},"",""]
[2.9387159978309665,{"$f":"_xlfn.CHISQ.DIST(A621,'Chi2-test af krydstabel'!$B$58,FALSE)","v":5.3542320126322311E-2},"",""]
[2.943517821356834,{"$f":"_xlfn.CHISQ.DIST(A622,'Chi2-test af krydstabel'!$B$58,FALSE)","v":5.3370338515248861E-2},"",""]
[2.9483196448827016,{"$f":"_xlfn.CHISQ.DIST(A623,'Chi2-test af krydstabel'!$B$58,FALSE)","v":5.3198980107787244E-2},"",""]
[2.9531214684085692,{"$f":"_xlfn.CHISQ.DIST(A624,'Chi2-test af krydstabel'!$B$58,FALSE)","v":5.3028242218052399E-2},"",""]
[2.9579232919344367,{"$f":"_xlfn.CHISQ.DIST(A625,'Chi2-test af krydstabel'!$B$58,FALSE)","v":5.2858122174580621E-2},"",""]
[2.9627251154603043,{"$f":"_xlfn.CHISQ.DIST(A626,'Chi2-test af krydstabel'!$B$58,FALSE)","v":5.2688617320231536E-2},"",""]
[2.9675269389861718,{"$f":"_xlfn.CHISQ.DIST(A627,'Chi2-test af krydstabel'!$B$58,FALSE)","v":5.2519725012090901E-2},"",""]
[2.9723287625120394,{"$f":"_xlfn.CHISQ.DIST(A628,'Chi2-test af krydstabel'!$B$58,FALSE)","v":5.2351442621374311E-2},"",""]
[2.9771305860379069,{"$f":"_xlfn.CHISQ.DIST(A629,'Chi2-test af krydstabel'!$B$58,FALSE)","v":5.2183767533331593E-2},"",""]
[2.9819324095637745,{"$f":"_xlfn.CHISQ.DIST(A630,'Chi2-test af krydstabel'!$B$58,FALSE)","v":5.2016697147152062E-2},"",""]
[2.986734233089642,{"$f":"_xlfn.CHISQ.DIST(A631,'Chi2-test af krydstabel'!$B$58,FALSE)","v":5.1850228875870603E-2},"",""]
[2.9915360566155096,{"$f":"_xlfn.CHISQ.DIST(A632,'Chi2-test af krydstabel'!$B$58,FALSE)","v":5.1684360146274512E-2},"",""]
[2.9963378801413771,{"$f":"_xlfn.CHISQ.DIST(A633,'Chi2-test af krydstabel'!$B$58,FALSE)","v":5.1519088398811079E-2},"",""]
[3.0011397036672447,{"$f":"_xlfn.CHISQ.DIST(A634,'Chi2-test af krydstabel'!$B$58,FALSE)","v":5.1354411087495944E-2},"",""]
[3.0059415271931123,{"$f":"_xlfn.CHISQ.DIST(A635,'Chi2-test af krydstabel'!$B$58,FALSE)","v":5.119032567982236E-2},"",""]
[3.0107433507189798,{"$f":"_xlfn.CHISQ.DIST(A636,'Chi2-test af krydstabel'!$B$58,FALSE)","v":5.1026829656670984E-2},"",""]
[3.0155451742448474,{"$f":"_xlfn.CHISQ.DIST(A637,'Chi2-test af krydstabel'!$B$58,FALSE)","v":5.0863920512220571E-2},"",""]
[3.0203469977707149,{"$f":"_xlfn.CHISQ.DIST(A638,'Chi2-test af krydstabel'!$B$58,FALSE)","v":5.070159575385938E-2},"",""]
[3.0251488212965825,{"$f":"_xlfn.CHISQ.DIST(A639,'Chi2-test af krydstabel'!$B$58,FALSE)","v":5.0539852902097275E-2},"",""]
[3.02995064482245,{"$f":"_xlfn.CHISQ.DIST(A640,'Chi2-test af krydstabel'!$B$58,FALSE)","v":5.0378689490478572E-2},"",""]
[3.0347524683483176,{"$f":"_xlfn.CHISQ.DIST(A641,'Chi2-test af krydstabel'!$B$58,FALSE)","v":5.0218103065495644E-2},"",""]
[3.0395542918741851,{"$f":"_xlfn.CHISQ.DIST(A642,'Chi2-test af krydstabel'!$B$58,FALSE)","v":5.0058091186503187E-2},"",""]
[3.0443561154000527,{"$f":"_xlfn.CHISQ.DIST(A643,'Chi2-test af krydstabel'!$B$58,FALSE)","v":4.9898651425633142E-2},"",""]
[3.0491579389259202,{"$f":"_xlfn.CHISQ.DIST(A644,'Chi2-test af krydstabel'!$B$58,FALSE)","v":4.9739781367710505E-2},"",""]
[3.0539597624517878,{"$f":"_xlfn.CHISQ.DIST(A645,'Chi2-test af krydstabel'!$B$58,FALSE)","v":4.9581478610169573E-2},"",""]
[3.0587615859776554,{"$f":"_xlfn.CHISQ.DIST(A646,'Chi2-test af krydstabel'!$B$58,FALSE)","v":4.9423740762971097E-2},"",""]
[3.0635634095035229,{"$f":"_xlfn.CHISQ.DIST(A647,'Chi2-test af krydstabel'!$B$58,FALSE)","v":4.9266565448519935E-2},"",""]
[3.0683652330293905,{"$f":"_xlfn.CHISQ.DIST(A648,'Chi2-test af krydstabel'!$B$58,FALSE)","v":4.9109950301583528E-2},"",""]
[3.073167056555258,{"$f":"_xlfn.CHISQ.DIST(A649,'Chi2-test af krydstabel'!$B$58,FALSE)","v":4.8953892969210912E-2},{"$f":"IF($A649<$D$3,IF($A650>$D$3,MAX($B$9:$B$1009),\"\"),\"\")","v":""},{"$f":"IF($A649<$D$4,IF($A650>$D$4,MAX($B$9:$B$1009),\"\"),\"\")","v":""}]
[{"$f":"+A649+$B$4","v":3.0779688800811256},{"$f":"_xlfn.CHISQ.DIST(A650,'Chi2-test af krydstabel'!$B$58,FALSE)","v":4.8798391110652484E-2},"",""]
[3.0827707036069931,{"$f":"_xlfn.CHISQ.DIST(A651,'Chi2-test af krydstabel'!$B$58,FALSE)","v":4.8643442397280336E-2},"",""]
[3.0875725271328607,{"$f":"_xlfn.CHISQ.DIST(A652,'Chi2-test af krydstabel'!$B$58,FALSE)","v":4.8489044512509336E-2},"",""]
[3.0923743506587282,{"$f":"_xlfn.CHISQ.DIST(A653,'Chi2-test af krydstabel'!$B$58,FALSE)","v":4.8335195151718711E-2},"",""]
[3.0971761741845958,{"$f":"_xlfn.CHISQ.DIST(A654,'Chi2-test af krydstabel'!$B$58,FALSE)","v":4.8181892022174405E-2},"",""]
[3.1019779977104633,{"$f":"_xlfn.CHISQ.DIST(A655,'Chi2-test af krydstabel'!$B$58,FALSE)","v":4.8029132842951953E-2},"",""]
[3.1067798212363309,{"$f":"_xlfn.CHISQ.DIST(A656,'Chi2-test af krydstabel'!$B$58,FALSE)","v":4.7876915344860042E-2},"",""]
[3.1115816447621985,{"$f":"_xlfn.CHISQ.DIST(A657,'Chi2-test af krydstabel'!$B$58,FALSE)","v":4.7725237270364651E-2},"",""]
[3.116383468288066,{"$f":"_xlfn.CHISQ.DIST(A658,'Chi2-test af krydstabel'!$B$58,FALSE)","v":4.7574096373513806E-2},"",""]
[3.1211852918139336,{"$f":"_xlfn.CHISQ.DIST(A659,'Chi2-test af krydstabel'!$B$58,FALSE)","v":4.7423490419862935E-2},"",""]
[3.1259871153398011,{"$f":"_xlfn.CHISQ.DIST(A660,'Chi2-test af krydstabel'!$B$58,FALSE)","v":4.7273417186400858E-2},"",""]
[3.1307889388656687,{"$f":"_xlfn.CHISQ.DIST(A661,'Chi2-test af krydstabel'!$B$58,FALSE)","v":4.7123874461476291E-2},"",""]
[3.1355907623915362,{"$f":"_xlfn.CHISQ.DIST(A662,'Chi2-test af krydstabel'!$B$58,FALSE)","v":4.6974860044725009E-2},"",""]
[3.1403925859174038,{"$f":"_xlfn.CHISQ.DIST(A663,'Chi2-test af krydstabel'!$B$58,FALSE)","v":4.6826371746997546E-2},"",""]
[3.1451944094432713,{"$f":"_xlfn.CHISQ.DIST(A664,'Chi2-test af krydstabel'!$B$58,FALSE)","v":4.6678407390287467E-2},"",""]
[3.1499962329691389,{"$f":"_xlfn.CHISQ.DIST(A665,'Chi2-test af krydstabel'!$B$58,FALSE)","v":4.6530964807660252E-2},"",""]
[3.1547980564950064,{"$f":"_xlfn.CHISQ.DIST(A666,'Chi2-test af krydstabel'!$B$58,FALSE)","v":4.6384041843182691E-2},"",""]
[3.159599880020874,{"$f":"_xlfn.CHISQ.DIST(A667,'Chi2-test af krydstabel'!$B$58,FALSE)","v":4.6237636351852858E-2},"",""]
[3.1644017035467416,{"$f":"_xlfn.CHISQ.DIST(A668,'Chi2-test af krydstabel'!$B$58,FALSE)","v":4.6091746199530645E-2},"",""]
[3.1692035270726091,{"$f":"_xlfn.CHISQ.DIST(A669,'Chi2-test af krydstabel'!$B$58,FALSE)","v":4.5946369262868825E-2},"",""]
[3.1740053505984767,{"$f":"_xlfn.CHISQ.DIST(A670,'Chi2-test af krydstabel'!$B$58,FALSE)","v":4.5801503429244696E-2},"",""]
[3.1788071741243442,{"$f":"_xlfn.CHISQ.DIST(A671,'Chi2-test af krydstabel'!$B$58,FALSE)","v":4.5657146596692191E-2},"",""]
[3.1836089976502118,{"$f":"_xlfn.CHISQ.DIST(A672,'Chi2-test af krydstabel'!$B$58,FALSE)","v":4.5513296673834559E-2},"",""]
[3.1884108211760793,{"$f":"_xlfn.CHISQ.DIST(A673,'Chi2-test af krydstabel'!$B$58,FALSE)","v":4.5369951579817658E-2},"",""]
[3.1932126447019469,{"$f":"_xlfn.CHISQ.DIST(A674,'Chi2-test af krydstabel'!$B$58,FALSE)","v":4.5227109244243564E-2},"",""]
[3.1980144682278144,{"$f":"_xlfn.CHISQ.DIST(A675,'Chi2-test af krydstabel'!$B$58,FALSE)","v":4.5084767607104906E-2},"",""]
[3.202816291753682,{"$f":"_xlfn.CHISQ.DIST(A676,'Chi2-test af krydstabel'!$B$58,FALSE)","v":4.4942924618719612E-2},"",""]
[3.2076181152795495,{"$f":"_xlfn.CHISQ.DIST(A677,'Chi2-test af krydstabel'!$B$58,FALSE)","v":4.4801578239666136E-2},"",""]
[3.2124199388054171,{"$f":"_xlfn.CHISQ.DIST(A678,'Chi2-test af krydstabel'!$B$58,FALSE)","v":4.4660726440719278E-2},"",""]
[3.2172217623312847,{"$f":"_xlfn.CHISQ.DIST(A679,'Chi2-test af krydstabel'!$B$58,FALSE)","v":4.4520367202786425E-2},"",""]
[3.2220235858571522,{"$f":"_xlfn.CHISQ.DIST(A680,'Chi2-test af krydstabel'!$B$58,FALSE)","v":4.4380498516844294E-2},"",""]
[3.2268254093830198,{"$f":"_xlfn.CHISQ.DIST(A681,'Chi2-test af krydstabel'!$B$58,FALSE)","v":4.4241118383876246E-2},"",""]
[3.2316272329088873,{"$f":"_xlfn.CHISQ.DIST(A682,'Chi2-test af krydstabel'!$B$58,FALSE)","v":4.4102224814809944E-2},"",""]
[3.2364290564347549,{"$f":"_xlfn.CHISQ.DIST(A683,'Chi2-test af krydstabel'!$B$58,FALSE)","v":4.396381583045559E-2},"",""]
[3.2412308799606224,{"$f":"_xlfn.CHISQ.DIST(A684,'Chi2-test af krydstabel'!$B$58,FALSE)","v":4.3825889461444639E-2},"",""]
[3.24603270348649,{"$f":"_xlfn.CHISQ.DIST(A685,'Chi2-test af krydstabel'!$B$58,FALSE)","v":4.3688443748168923E-2},"",""]
[3.2508345270123575,{"$f":"_xlfn.CHISQ.DIST(A686,'Chi2-test af krydstabel'!$B$58,FALSE)","v":4.3551476740720303E-2},"",""]
[3.2556363505382251,{"$f":"_xlfn.CHISQ.DIST(A687,'Chi2-test af krydstabel'!$B$58,FALSE)","v":4.3414986498830722E-2},"",""]
[3.2604381740640926,{"$f":"_xlfn.CHISQ.DIST(A688,'Chi2-test af krydstabel'!$B$58,FALSE)","v":4.3278971091812779E-2},"",""]
[3.2652399975899602,{"$f":"_xlfn.CHISQ.DIST(A689,'Chi2-test af krydstabel'!$B$58,FALSE)","v":4.3143428598500719E-2},"",""]
[3.2700418211158278,{"$f":"_xlfn.CHISQ.DIST(A690,'Chi2-test af krydstabel'!$B$58,FALSE)","v":4.3008357107191836E-2},"",""]
[3.2748436446416953,{"$f":"_xlfn.CHISQ.DIST(A691,'Chi2-test af krydstabel'!$B$58,FALSE)","v":4.2873754715588457E-2},"",""]
[3.2796454681675629,{"$f":"_xlfn.CHISQ.DIST(A692,'Chi2-test af krydstabel'!$B$58,FALSE)","v":4.2739619530740194E-2},"",""]
[3.2844472916934304,{"$f":"_xlfn.CHISQ.DIST(A693,'Chi2-test af krydstabel'!$B$58,FALSE)","v":4.2605949668986745E-2},"",""]
[3.289249115219298,{"$f":"_xlfn.CHISQ.DIST(A694,'Chi2-test af krydstabel'!$B$58,FALSE)","v":4.2472743255901099E-2},"",""]
[3.2940509387451655,{"$f":"_xlfn.CHISQ.DIST(A695,'Chi2-test af krydstabel'!$B$58,FALSE)","v":4.2339998426233143E-2},"",""]
[3.2988527622710331,{"$f":"_xlfn.CHISQ.DIST(A696,'Chi2-test af krydstabel'!$B$58,FALSE)","v":4.220771332385375E-2},"",""]
[3.3036545857969006,{"$f":"_xlfn.CHISQ.DIST(A697,'Chi2-test af krydstabel'!$B$58,FALSE)","v":4.2075886101699274E-2},"",""]
[3.3084564093227682,{"$f":"_xlfn.CHISQ.DIST(A698,'Chi2-test af krydstabel'!$B$58,FALSE)","v":4.1944514921716358E-2},"",""]
[3.3132582328486357,{"$f":"_xlfn.CHISQ.DIST(A699,'Chi2-test af krydstabel'!$B$58,FALSE)","v":4.1813597954807387E-2},"",""]
[3.3180600563745033,{"$f":"_xlfn.CHISQ.DIST(A700,'Chi2-test af krydstabel'!$B$58,FALSE)","v":4.1683133380776068E-2},"",""]
[3.3228618799003709,{"$f":"_xlfn.CHISQ.DIST(A701,'Chi2-test af krydstabel'!$B$58,FALSE)","v":4.1553119388273628E-2},"",""]
[3.3276637034262384,{"$f":"_xlfn.CHISQ.DIST(A702,'Chi2-test af krydstabel'!$B$58,FALSE)","v":4.1423554174745372E-2},"",""]
[3.332465526952106,{"$f":"_xlfn.CHISQ.DIST(A703,'Chi2-test af krydstabel'!$B$58,FALSE)","v":4.1294435946377515E-2},"",""]
[3.3372673504779735,{"$f":"_xlfn.CHISQ.DIST(A704,'Chi2-test af krydstabel'!$B$58,FALSE)","v":4.1165762918044607E-2},"",""]
[3.3420691740038411,{"$f":"_xlfn.CHISQ.DIST(A705,'Chi2-test af krydstabel'!$B$58,FALSE)","v":4.1037533313257199E-2},"",""]
[3.3468709975297086,{"$f":"_xlfn.CHISQ.DIST(A706,'Chi2-test af krydstabel'!$B$58,FALSE)","v":4.0909745364109955E-2},"",""]
[3.3516728210555762,{"$f":"_xlfn.CHISQ.DIST(A707,'Chi2-test af krydstabel'!$B$58,FALSE)","v":4.0782397311230116E-2},"",""]
[3.3564746445814437,{"$f":"_xlfn.CHISQ.DIST(A708,'Chi2-test af krydstabel'!$B$58,FALSE)","v":4.0655487403726466E-2},"",""]
[3.3612764681073113,{"$f":"_xlfn.CHISQ.DIST(A709,'Chi2-test af krydstabel'!$B$58,FALSE)","v":4.0529013899138433E-2},"",""]
[3.3660782916331788,{"$f":"_xlfn.CHISQ.DIST(A710,'Chi2-test af krydstabel'!$B$58,FALSE)","v":4.0402975063385867E-2},"",""]
[3.3708801151590464,{"$f":"_xlfn.CHISQ.DIST(A711,'Chi2-test af krydstabel'!$B$58,FALSE)","v":4.0277369170718925E-2},"",""]
[3.375681938684914,{"$f":"_xlfn.CHISQ.DIST(A712,'Chi2-test af krydstabel'!$B$58,FALSE)","v":4.0152194503668477E-2},"",""]
[3.3804837622107815,{"$f":"_xlfn.CHISQ.DIST(A713,'Chi2-test af krydstabel'!$B$58,FALSE)","v":4.002744935299684E-2},{"$f":"IF($A713<$D$3,IF($A714>$D$3,MAX($B$9:$B$1009),\"\"),\"\")","v":""},{"$f":"IF($A713<$D$4,IF($A714>$D$4,MAX($B$9:$B$1009),\"\"),\"\")","v":""}]
[{"$f":"+A713+$B$4","v":3.3852855857366491},{"$f":"_xlfn.CHISQ.DIST(A714,'Chi2-test af krydstabel'!$B$58,FALSE)","v":3.9903132017648869E-2},"",""]
[3.3900874092625166,{"$f":"_xlfn.CHISQ.DIST(A715,'Chi2-test af krydstabel'!$B$58,FALSE)","v":3.9779240804703395E-2},"",""]
[3.3948892327883842,{"$f":"_xlfn.CHISQ.DIST(A716,'Chi2-test af krydstabel'!$B$58,FALSE)","v":3.9655774029325019E-2},"",""]
[3.3996910563142517,{"$f":"_xlfn.CHISQ.DIST(A717,'Chi2-test af krydstabel'!$B$58,FALSE)","v":3.9532730014716314E-2},"",""]
[3.4044928798401193,{"$f":"_xlfn.CHISQ.DIST(A718,'Chi2-test af krydstabel'!$B$58,FALSE)","v":3.9410107092070282E-2},"",""]
[3.4092947033659868,{"$f":"_xlfn.CHISQ.DIST(A719,'Chi2-test af krydstabel'!$B$58,FALSE)","v":3.9287903600523227E-2},"",""]
[3.4140965268918544,{"$f":"_xlfn.CHISQ.DIST(A720,'Chi2-test af krydstabel'!$B$58,FALSE)","v":3.9166117887107943E-2},"",""]
[3.4188983504177219,{"$f":"_xlfn.CHISQ.DIST(A721,'Chi2-test af krydstabel'!$B$58,FALSE)","v":3.9044748306707261E-2},"",""]
[3.4237001739435895,{"$f":"_xlfn.CHISQ.DIST(A722,'Chi2-test af krydstabel'!$B$58,FALSE)","v":3.8923793222007938E-2},"",""]
[3.4285019974694571,{"$f":"_xlfn.CHISQ.DIST(A723,'Chi2-test af krydstabel'!$B$58,FALSE)","v":3.8803251003454803E-2},"",""]
[3.4333038209953246,{"$f":"_xlfn.CHISQ.DIST(A724,'Chi2-test af krydstabel'!$B$58,FALSE)","v":3.8683120029205341E-2},"",""]
[3.4381056445211922,{"$f":"_xlfn.CHISQ.DIST(A725,'Chi2-test af krydstabel'!$B$58,FALSE)","v":3.8563398685084592E-2},"",""]
[3.4429074680470597,{"$f":"_xlfn.CHISQ.DIST(A726,'Chi2-test af krydstabel'!$B$58,FALSE)","v":3.8444085364540227E-2},"",""]
[3.4477092915729273,{"$f":"_xlfn.CHISQ.DIST(A727,'Chi2-test af krydstabel'!$B$58,FALSE)","v":3.8325178468598203E-2},"",""]
[3.4525111150987948,{"$f":"_xlfn.CHISQ.DIST(A728,'Chi2-test af krydstabel'!$B$58,FALSE)","v":3.8206676405818506E-2},"",""]
[3.4573129386246624,{"$f":"_xlfn.CHISQ.DIST(A729,'Chi2-test af krydstabel'!$B$58,FALSE)","v":3.8088577592251302E-2},"",""]
[3.4621147621505299,{"$f":"_xlfn.CHISQ.DIST(A730,'Chi2-test af krydstabel'!$B$58,FALSE)","v":3.7970880451393463E-2},"",""]
[3.4669165856763975,{"$f":"_xlfn.CHISQ.DIST(A731,'Chi2-test af krydstabel'!$B$58,FALSE)","v":3.7853583414145305E-2},"",""]
[3.471718409202265,{"$f":"_xlfn.CHISQ.DIST(A732,'Chi2-test af krydstabel'!$B$58,FALSE)","v":3.7736684918767638E-2},"",""]
[3.4765202327281326,{"$f":"_xlfn.CHISQ.DIST(A733,'Chi2-test af krydstabel'!$B$58,FALSE)","v":3.7620183410839232E-2},"",""]
[3.4813220562540002,{"$f":"_xlfn.CHISQ.DIST(A734,'Chi2-test af krydstabel'!$B$58,FALSE)","v":3.7504077343214461E-2},"",""]
[3.4861238797798677,{"$f":"_xlfn.CHISQ.DIST(A735,'Chi2-test af krydstabel'!$B$58,FALSE)","v":3.7388365175981327E-2},"",""]
[3.4909257033057353,{"$f":"_xlfn.CHISQ.DIST(A736,'Chi2-test af krydstabel'!$B$58,FALSE)","v":3.7273045376419768E-2},"",""]
[3.4957275268316028,{"$f":"_xlfn.CHISQ.DIST(A737,'Chi2-test af krydstabel'!$B$58,FALSE)","v":3.7158116418960156E-2},"",""]
[3.5005293503574704,{"$f":"_xlfn.CHISQ.DIST(A738,'Chi2-test af krydstabel'!$B$58,FALSE)","v":3.7043576785142314E-2},"",""]
[3.5053311738833379,{"$f":"_xlfn.CHISQ.DIST(A739,'Chi2-test af krydstabel'!$B$58,FALSE)","v":3.6929424963574632E-2},"",""]
[3.5101329974092055,{"$f":"_xlfn.CHISQ.DIST(A740,'Chi2-test af krydstabel'!$B$58,FALSE)","v":3.6815659449893484E-2},"",""]
[3.514934820935073,{"$f":"_xlfn.CHISQ.DIST(A741,'Chi2-test af krydstabel'!$B$58,FALSE)","v":3.6702278746723049E-2},"",""]
[3.5197366444609406,{"$f":"_xlfn.CHISQ.DIST(A742,'Chi2-test af krydstabel'!$B$58,FALSE)","v":3.6589281363635331E-2},"",""]
[3.5245384679868081,{"$f":"_xlfn.CHISQ.DIST(A743,'Chi2-test af krydstabel'!$B$58,FALSE)","v":3.6476665817110468E-2},"",""]
[3.5293402915126757,{"$f":"_xlfn.CHISQ.DIST(A744,'Chi2-test af krydstabel'!$B$58,FALSE)","v":3.6364430630497283E-2},"",""]
[3.5341421150385433,{"$f":"_xlfn.CHISQ.DIST(A745,'Chi2-test af krydstabel'!$B$58,FALSE)","v":3.6252574333974212E-2},"",""]
[3.5389439385644108,{"$f":"_xlfn.CHISQ.DIST(A746,'Chi2-test af krydstabel'!$B$58,FALSE)","v":3.6141095464510435E-2},"",""]
[3.5437457620902784,{"$f":"_xlfn.CHISQ.DIST(A747,'Chi2-test af krydstabel'!$B$58,FALSE)","v":3.6029992565827285E-2},"",""]
[3.5485475856161459,{"$f":"_xlfn.CHISQ.DIST(A748,'Chi2-test af krydstabel'!$B$58,FALSE)","v":3.5919264188359917E-2},"",""]
[3.5533494091420135,{"$f":"_xlfn.CHISQ.DIST(A749,'Chi2-test af krydstabel'!$B$58,FALSE)","v":3.5808908889219296E-2},"",""]
[3.558151232667881,{"$f":"_xlfn.CHISQ.DIST(A750,'Chi2-test af krydstabel'!$B$58,FALSE)","v":3.5698925232154385E-2},"",""]
[3.5629530561937486,{"$f":"_xlfn.CHISQ.DIST(A751,'Chi2-test af krydstabel'!$B$58,FALSE)","v":3.5589311787514642E-2},"",""]
[3.5677548797196161,{"$f":"_xlfn.CHISQ.DIST(A752,'Chi2-test af krydstabel'!$B$58,FALSE)","v":3.5480067132212738E-2},"",""]
[3.5725567032454837,{"$f":"_xlfn.CHISQ.DIST(A753,'Chi2-test af krydstabel'!$B$58,FALSE)","v":3.5371189849687609E-2},"",""]
[3.5773585267713512,{"$f":"_xlfn.CHISQ.DIST(A754,'Chi2-test af krydstabel'!$B$58,FALSE)","v":3.5262678529867662E-2},"",""]
[3.5821603502972188,{"$f":"_xlfn.CHISQ.DIST(A755,'Chi2-test af krydstabel'!$B$58,FALSE)","v":3.5154531769134287E-2},"",""]
[3.5869621738230864,{"$f":"_xlfn.CHISQ.DIST(A756,'Chi2-test af krydstabel'!$B$58,FALSE)","v":3.5046748170285642E-2},"",""]
[3.5917639973489539,{"$f":"_xlfn.CHISQ.DIST(A757,'Chi2-test af krydstabel'!$B$58,FALSE)","v":3.4939326342500659E-2},"",""]
[3.5965658208748215,{"$f":"_xlfn.CHISQ.DIST(A758,'Chi2-test af krydstabel'!$B$58,FALSE)","v":3.4832264901303298E-2},"",""]
[3.601367644400689,{"$f":"_xlfn.CHISQ.DIST(A759,'Chi2-test af krydstabel'!$B$58,FALSE)","v":3.4725562468527052E-2},"",""]
[3.6061694679265566,{"$f":"_xlfn.CHISQ.DIST(A760,'Chi2-test af krydstabel'!$B$58,FALSE)","v":3.4619217672279705E-2},"",""]
[3.6109712914524241,{"$f":"_xlfn.CHISQ.DIST(A761,'Chi2-test af krydstabel'!$B$58,FALSE)","v":3.4513229146908311E-2},"",""]
[3.6157731149782917,{"$f":"_xlfn.CHISQ.DIST(A762,'Chi2-test af krydstabel'!$B$58,FALSE)","v":3.4407595532964422E-2},"",""]
[3.6205749385041592,{"$f":"_xlfn.CHISQ.DIST(A763,'Chi2-test af krydstabel'!$B$58,FALSE)","v":3.4302315477169588E-2},"",""]
[3.6253767620300268,{"$f":"_xlfn.CHISQ.DIST(A764,'Chi2-test af krydstabel'!$B$58,FALSE)","v":3.4197387632381025E-2},"",""]
[3.6301785855558943,{"$f":"_xlfn.CHISQ.DIST(A765,'Chi2-test af krydstabel'!$B$58,FALSE)","v":3.4092810657557565E-2},"",""]
[3.6349804090817619,{"$f":"_xlfn.CHISQ.DIST(A766,'Chi2-test af krydstabel'!$B$58,FALSE)","v":3.3988583217725826E-2},"",""]
[3.6397822326076295,{"$f":"_xlfn.CHISQ.DIST(A767,'Chi2-test af krydstabel'!$B$58,FALSE)","v":3.3884703983946628E-2},"",""]
[3.644584056133497,{"$f":"_xlfn.CHISQ.DIST(A768,'Chi2-test af krydstabel'!$B$58,FALSE)","v":3.3781171633281599E-2},"",""]
[3.6493858796593646,{"$f":"_xlfn.CHISQ.DIST(A769,'Chi2-test af krydstabel'!$B$58,FALSE)","v":3.3677984848760029E-2},"",""]
[3.6541877031852321,{"$f":"_xlfn.CHISQ.DIST(A770,'Chi2-test af krydstabel'!$B$58,FALSE)","v":3.3575142319345982E-2},"",""]
[3.6589895267110997,{"$f":"_xlfn.CHISQ.DIST(A771,'Chi2-test af krydstabel'!$B$58,FALSE)","v":3.3472642739905557E-2},"",""]
[3.6637913502369672,{"$f":"_xlfn.CHISQ.DIST(A772,'Chi2-test af krydstabel'!$B$58,FALSE)","v":3.3370484811174425E-2},"",""]
[3.6685931737628348,{"$f":"_xlfn.CHISQ.DIST(A773,'Chi2-test af krydstabel'!$B$58,FALSE)","v":3.3268667239725602E-2},"",""]
[3.6733949972887023,{"$f":"_xlfn.CHISQ.DIST(A774,'Chi2-test af krydstabel'!$B$58,FALSE)","v":3.3167188737937343E-2},"",""]
[3.6781968208145699,{"$f":"_xlfn.CHISQ.DIST(A775,'Chi2-test af krydstabel'!$B$58,FALSE)","v":3.3066048023961382E-2},"",""]
[3.6829986443404374,{"$f":"_xlfn.CHISQ.DIST(A776,'Chi2-test af krydstabel'!$B$58,FALSE)","v":3.2965243821691283E-2},"",""]
[3.687800467866305,{"$f":"_xlfn.CHISQ.DIST(A777,'Chi2-test af krydstabel'!$B$58,FALSE)","v":3.2864774860731062E-2},{"$f":"IF($A777<$D$3,IF($A778>$D$3,MAX($B$9:$B$1009),\"\"),\"\")","v":""},{"$f":"IF($A777<$D$4,IF($A778>$D$4,MAX($B$9:$B$1009),\"\"),\"\")","v":""}]
[{"$f":"+A777+$B$4","v":3.6926022913921726},{"$f":"_xlfn.CHISQ.DIST(A778,'Chi2-test af krydstabel'!$B$58,FALSE)","v":3.2764639876363966E-2},"",""]
[3.6974041149180401,{"$f":"_xlfn.CHISQ.DIST(A779,'Chi2-test af krydstabel'!$B$58,FALSE)","v":3.2664837609521526E-2},"",""]
[3.7022059384439077,{"$f":"_xlfn.CHISQ.DIST(A780,'Chi2-test af krydstabel'!$B$58,FALSE)","v":3.2565366806752767E-2},"",""]
[3.7070077619697752,{"$f":"_xlfn.CHISQ.DIST(A781,'Chi2-test af krydstabel'!$B$58,FALSE)","v":3.2466226220193635E-2},"",""]
[3.7118095854956428,{"$f":"_xlfn.CHISQ.DIST(A782,'Chi2-test af krydstabel'!$B$58,FALSE)","v":3.2367414607536664E-2},"",""]
[3.7166114090215103,{"$f":"_xlfn.CHISQ.DIST(A783,'Chi2-test af krydstabel'!$B$58,FALSE)","v":3.2268930732000753E-2},"",""]
[3.7214132325473779,{"$f":"_xlfn.CHISQ.DIST(A784,'Chi2-test af krydstabel'!$B$58,FALSE)","v":3.2170773362301279E-2},"",""]
[3.7262150560732454,{"$f":"_xlfn.CHISQ.DIST(A785,'Chi2-test af krydstabel'!$B$58,FALSE)","v":3.2072941272620267E-2},"",""]
[3.731016879599113,{"$f":"_xlfn.CHISQ.DIST(A786,'Chi2-test af krydstabel'!$B$58,FALSE)","v":3.1975433242576873E-2},"",""]
[3.7358187031249805,{"$f":"_xlfn.CHISQ.DIST(A787,'Chi2-test af krydstabel'!$B$58,FALSE)","v":3.187824805719796E-2},"",""]
[3.7406205266508481,{"$f":"_xlfn.CHISQ.DIST(A788,'Chi2-test af krydstabel'!$B$58,FALSE)","v":3.1781384506889006E-2},"",""]
[3.7454223501767157,{"$f":"_xlfn.CHISQ.DIST(A789,'Chi2-test af krydstabel'!$B$58,FALSE)","v":3.1684841387405009E-2},"",""]
[3.7502241737025832,{"$f":"_xlfn.CHISQ.DIST(A790,'Chi2-test af krydstabel'!$B$58,FALSE)","v":3.1588617499821808E-2},"",""]
[3.7550259972284508,{"$f":"_xlfn.CHISQ.DIST(A791,'Chi2-test af krydstabel'!$B$58,FALSE)","v":3.1492711650507377E-2},"",""]
[3.7598278207543183,{"$f":"_xlfn.CHISQ.DIST(A792,'Chi2-test af krydstabel'!$B$58,FALSE)","v":3.1397122651093491E-2},"",""]
[3.7646296442801859,{"$f":"_xlfn.CHISQ.DIST(A793,'Chi2-test af krydstabel'!$B$58,FALSE)","v":3.1301849318447469E-2},"",""]
[3.7694314678060534,{"$f":"_xlfn.CHISQ.DIST(A794,'Chi2-test af krydstabel'!$B$58,FALSE)","v":3.1206890474644096E-2},"",""]
[3.774233291331921,{"$f":"_xlfn.CHISQ.DIST(A795,'Chi2-test af krydstabel'!$B$58,FALSE)","v":3.1112244946937824E-2},"",""]
[3.7790351148577885,{"$f":"_xlfn.CHISQ.DIST(A796,'Chi2-test af krydstabel'!$B$58,FALSE)","v":3.1017911567735031E-2},"",""]
[3.7838369383836561,{"$f":"_xlfn.CHISQ.DIST(A797,'Chi2-test af krydstabel'!$B$58,FALSE)","v":3.0923889174566586E-2},"",""]
[3.7886387619095236,{"$f":"_xlfn.CHISQ.DIST(A798,'Chi2-test af krydstabel'!$B$58,FALSE)","v":3.0830176610060486E-2},"",""]
[3.7934405854353912,{"$f":"_xlfn.CHISQ.DIST(A799,'Chi2-test af krydstabel'!$B$58,FALSE)","v":3.0736772721914749E-2},"",""]
[3.7982424089612588,{"$f":"_xlfn.CHISQ.DIST(A800,'Chi2-test af krydstabel'!$B$58,FALSE)","v":3.0643676362870399E-2},"",""]
[3.8030442324871263,{"$f":"_xlfn.CHISQ.DIST(A801,'Chi2-test af krydstabel'!$B$58,FALSE)","v":3.0550886390684744E-2},"",""]
[3.8078460560129939,{"$f":"_xlfn.CHISQ.DIST(A802,'Chi2-test af krydstabel'!$B$58,FALSE)","v":3.0458401668104717E-2},"",""]
[3.8126478795388614,{"$f":"_xlfn.CHISQ.DIST(A803,'Chi2-test af krydstabel'!$B$58,FALSE)","v":3.0366221062840443E-2},"",""]
[3.817449703064729,{"$f":"_xlfn.CHISQ.DIST(A804,'Chi2-test af krydstabel'!$B$58,FALSE)","v":3.027434344753898E-2},"",""]
[3.8222515265905965,{"$f":"_xlfn.CHISQ.DIST(A805,'Chi2-test af krydstabel'!$B$58,FALSE)","v":3.0182767699758216E-2},"",""]
[3.8270533501164641,{"$f":"_xlfn.CHISQ.DIST(A806,'Chi2-test af krydstabel'!$B$58,FALSE)","v":3.0091492701940909E-2},"",""]
[3.8318551736423316,{"$f":"_xlfn.CHISQ.DIST(A807,'Chi2-test af krydstabel'!$B$58,FALSE)","v":3.0000517341388963E-2},"",""]
[3.8366569971681992,{"$f":"_xlfn.CHISQ.DIST(A808,'Chi2-test af krydstabel'!$B$58,FALSE)","v":2.990984051023779E-2},{"$f":"IF($A808<$D$3,IF($A809>$D$3,MAX($B$9:$B$1009),\"\"),\"\")","v":{"$error":"#NUM!"}},""]
[3.8414588206940667,{"$f":"_xlfn.CHISQ.DIST(A809,'Chi2-test af krydstabel'!$B$58,FALSE)","v":2.9819461105430916E-2},"",""]
[3.8462606442199343,{"$f":"_xlfn.CHISQ.DIST(A810,'Chi2-test af krydstabel'!$B$58,FALSE)","v":2.9729378028694648E-2},"",""]
[3.8510624677458019,{"$f":"_xlfn.CHISQ.DIST(A811,'Chi2-test af krydstabel'!$B$58,FALSE)","v":2.9639590186513052E-2},"",""]
[3.8558642912716694,{"$f":"_xlfn.CHISQ.DIST(A812,'Chi2-test af krydstabel'!$B$58,FALSE)","v":2.9550096490102901E-2},"",""]
[3.860666114797537,{"$f":"_xlfn.CHISQ.DIST(A813,'Chi2-test af krydstabel'!$B$58,FALSE)","v":2.9460895855388979E-2},"",""]
[3.8654679383234045,{"$f":"_xlfn.CHISQ.DIST(A814,'Chi2-test af krydstabel'!$B$58,FALSE)","v":2.9371987202979399E-2},"",""]
[3.8702697618492721,{"$f":"_xlfn.CHISQ.DIST(A815,'Chi2-test af krydstabel'!$B$58,FALSE)","v":2.9283369458141112E-2},"",""]
[3.8750715853751396,{"$f":"_xlfn.CHISQ.DIST(A816,'Chi2-test af krydstabel'!$B$58,FALSE)","v":2.9195041550775659E-2},"",""]
[3.8798734089010072,{"$f":"_xlfn.CHISQ.DIST(A817,'Chi2-test af krydstabel'!$B$58,FALSE)","v":2.9107002415394923E-2},"",""]
[3.8846752324268747,{"$f":"_xlfn.CHISQ.DIST(A818,'Chi2-test af krydstabel'!$B$58,FALSE)","v":2.9019250991097187E-2},"",""]
[3.8894770559527423,{"$f":"_xlfn.CHISQ.DIST(A819,'Chi2-test af krydstabel'!$B$58,FALSE)","v":2.8931786221543243E-2},"",""]
[3.8942788794786098,{"$f":"_xlfn.CHISQ.DIST(A820,'Chi2-test af krydstabel'!$B$58,FALSE)","v":2.8844607054932692E-2},"",""]
[3.8990807030044774,{"$f":"_xlfn.CHISQ.DIST(A821,'Chi2-test af krydstabel'!$B$58,FALSE)","v":2.8757712443980368E-2},"",""]
[3.903882526530345,{"$f":"_xlfn.CHISQ.DIST(A822,'Chi2-test af krydstabel'!$B$58,FALSE)","v":2.8671101345892985E-2},"",""]
[3.9086843500562125,{"$f":"_xlfn.CHISQ.DIST(A823,'Chi2-test af krydstabel'!$B$58,FALSE)","v":2.858477272234582E-2},"",""]
[3.9134861735820801,{"$f":"_xlfn.CHISQ.DIST(A824,'Chi2-test af krydstabel'!$B$58,FALSE)","v":2.8498725539459615E-2},"",""]
[3.9182879971079476,{"$f":"_xlfn.CHISQ.DIST(A825,'Chi2-test af krydstabel'!$B$58,FALSE)","v":2.8412958767777639E-2},"",""]
[3.9230898206338152,{"$f":"_xlfn.CHISQ.DIST(A826,'Chi2-test af krydstabel'!$B$58,FALSE)","v":2.8327471382242824E-2},"",""]
[3.9278916441596827,{"$f":"_xlfn.CHISQ.DIST(A827,'Chi2-test af krydstabel'!$B$58,FALSE)","v":2.8242262362175113E-2},"",""]
[3.9326934676855503,{"$f":"_xlfn.CHISQ.DIST(A828,'Chi2-test af krydstabel'!$B$58,FALSE)","v":2.8157330691248914E-2},"",""]
[3.9374952912114178,{"$f":"_xlfn.CHISQ.DIST(A829,'Chi2-test af krydstabel'!$B$58,FALSE)","v":2.8072675357470694E-2},"",""]
[3.9422971147372854,{"$f":"_xlfn.CHISQ.DIST(A830,'Chi2-test af krydstabel'!$B$58,FALSE)","v":2.798829535315675E-2},"",""]
[3.9470989382631529,{"$f":"_xlfn.CHISQ.DIST(A831,'Chi2-test af krydstabel'!$B$58,FALSE)","v":2.790418967491105E-2},"",""]
[3.9519007617890205,{"$f":"_xlfn.CHISQ.DIST(A832,'Chi2-test af krydstabel'!$B$58,FALSE)","v":2.782035732360329E-2},"",""]
[3.9567025853148881,{"$f":"_xlfn.CHISQ.DIST(A833,'Chi2-test af krydstabel'!$B$58,FALSE)","v":2.7736797304347038E-2},"",""]
[3.9615044088407556,{"$f":"_xlfn.CHISQ.DIST(A834,'Chi2-test af krydstabel'!$B$58,FALSE)","v":2.7653508626478047E-2},"",""]
[3.9663062323666232,{"$f":"_xlfn.CHISQ.DIST(A835,'Chi2-test af krydstabel'!$B$58,FALSE)","v":2.7570490303532636E-2},"",""]
[3.9711080558924907,{"$f":"_xlfn.CHISQ.DIST(A836,'Chi2-test af krydstabel'!$B$58,FALSE)","v":2.7487741353226309E-2},"",""]
[3.9759098794183583,{"$f":"_xlfn.CHISQ.DIST(A837,'Chi2-test af krydstabel'!$B$58,FALSE)","v":2.7405260797432406E-2},"",""]
[3.9807117029442258,{"$f":"_xlfn.CHISQ.DIST(A838,'Chi2-test af krydstabel'!$B$58,FALSE)","v":2.7323047662160978E-2},"",""]
[3.9855135264700934,{"$f":"_xlfn.CHISQ.DIST(A839,'Chi2-test af krydstabel'!$B$58,FALSE)","v":2.724110097753769E-2},"",""]
[3.9903153499959609,{"$f":"_xlfn.CHISQ.DIST(A840,'Chi2-test af krydstabel'!$B$58,FALSE)","v":2.715941977778295E-2},"",""]
[3.9951171735218285,{"$f":"_xlfn.CHISQ.DIST(A841,'Chi2-test af krydstabel'!$B$58,FALSE)","v":2.7078003101191132E-2},{"$f":"IF($A841<$D$3,IF($A842>$D$3,MAX($B$9:$B$1009),\"\"),\"\")","v":""},{"$f":"IF($A841<$D$4,IF($A842>$D$4,MAX($B$9:$B$1009),\"\"),\"\")","v":""}]
[{"$f":"+A841+$B$4","v":3.999918997047696},{"$f":"_xlfn.CHISQ.DIST(A842,'Chi2-test af krydstabel'!$B$58,FALSE)","v":2.6996849990109862E-2},"",""]
[4.0047208205735636,{"$f":"_xlfn.CHISQ.DIST(A843,'Chi2-test af krydstabel'!$B$58,FALSE)","v":2.6915959490919589E-2},"",""]
[4.0095226440994312,{"$f":"_xlfn.CHISQ.DIST(A844,'Chi2-test af krydstabel'!$B$58,FALSE)","v":2.6835330654013105E-2},"",""]
[4.0143244676252987,{"$f":"_xlfn.CHISQ.DIST(A845,'Chi2-test af krydstabel'!$B$58,FALSE)","v":2.6754962533775281E-2},"",""]
[4.0191262911511663,{"$f":"_xlfn.CHISQ.DIST(A846,'Chi2-test af krydstabel'!$B$58,FALSE)","v":2.6674854188562955E-2},"",""]
[4.0239281146770338,{"$f":"_xlfn.CHISQ.DIST(A847,'Chi2-test af krydstabel'!$B$58,FALSE)","v":2.6595004680684865E-2},"",""]
[4.0287299382029014,{"$f":"_xlfn.CHISQ.DIST(A848,'Chi2-test af krydstabel'!$B$58,FALSE)","v":2.6515413076381771E-2},"",""]
[4.0335317617287689,{"$f":"_xlfn.CHISQ.DIST(A849,'Chi2-test af krydstabel'!$B$58,FALSE)","v":2.6436078445806647E-2},"",""]
[4.0383335852546365,{"$f":"_xlfn.CHISQ.DIST(A850,'Chi2-test af krydstabel'!$B$58,FALSE)","v":2.6356999863005038E-2},"",""]
[4.043135408780504,{"$f":"_xlfn.CHISQ.DIST(A851,'Chi2-test af krydstabel'!$B$58,FALSE)","v":2.6278176405895519E-2},"",""]
[4.0479372323063716,{"$f":"_xlfn.CHISQ.DIST(A852,'Chi2-test af krydstabel'!$B$58,FALSE)","v":2.6199607156250245E-2},"",""]
[4.0527390558322391,{"$f":"_xlfn.CHISQ.DIST(A853,'Chi2-test af krydstabel'!$B$58,FALSE)","v":2.612129119967568E-2},"",""]
[4.0575408793581067,{"$f":"_xlfn.CHISQ.DIST(A854,'Chi2-test af krydstabel'!$B$58,FALSE)","v":2.6043227625593381E-2},"",""]
[4.0623427028839743,{"$f":"_xlfn.CHISQ.DIST(A855,'Chi2-test af krydstabel'!$B$58,FALSE)","v":2.5965415527220956E-2},"",""]
[4.0671445264098418,{"$f":"_xlfn.CHISQ.DIST(A856,'Chi2-test af krydstabel'!$B$58,FALSE)","v":2.5887854001553069E-2},"",""]
[4.0719463499357094,{"$f":"_xlfn.CHISQ.DIST(A857,'Chi2-test af krydstabel'!$B$58,FALSE)","v":2.5810542149342627E-2},"",""]
[4.0767481734615769,{"$f":"_xlfn.CHISQ.DIST(A858,'Chi2-test af krydstabel'!$B$58,FALSE)","v":2.5733479075082045E-2},"",""]
[4.0815499969874445,{"$f":"_xlfn.CHISQ.DIST(A859,'Chi2-test af krydstabel'!$B$58,FALSE)","v":2.5656663886984638E-2},"",""]
[4.086351820513312,{"$f":"_xlfn.CHISQ.DIST(A860,'Chi2-test af krydstabel'!$B$58,FALSE)","v":2.5580095696966093E-2},"",""]
[4.0911536440391796,{"$f":"_xlfn.CHISQ.DIST(A861,'Chi2-test af krydstabel'!$B$58,FALSE)","v":2.550377362062612E-2},"",""]
[4.0959554675650471,{"$f":"_xlfn.CHISQ.DIST(A862,'Chi2-test af krydstabel'!$B$58,FALSE)","v":2.5427696777230131E-2},"",""]
[4.1007572910909147,{"$f":"_xlfn.CHISQ.DIST(A863,'Chi2-test af krydstabel'!$B$58,FALSE)","v":2.5351864289691092E-2},"",""]
[4.1055591146167822,{"$f":"_xlfn.CHISQ.DIST(A864,'Chi2-test af krydstabel'!$B$58,FALSE)","v":2.5276275284551467E-2},"",""]
[4.1103609381426498,{"$f":"_xlfn.CHISQ.DIST(A865,'Chi2-test af krydstabel'!$B$58,FALSE)","v":2.5200928891965246E-2},"",""]
[4.1151627616685174,{"$f":"_xlfn.CHISQ.DIST(A866,'Chi2-test af krydstabel'!$B$58,FALSE)","v":2.5125824245680099E-2},"",""]
[4.1199645851943849,{"$f":"_xlfn.CHISQ.DIST(A867,'Chi2-test af krydstabel'!$B$58,FALSE)","v":2.5050960483019663E-2},"",""]
[4.1247664087202525,{"$f":"_xlfn.CHISQ.DIST(A868,'Chi2-test af krydstabel'!$B$58,FALSE)","v":2.4976336744865886E-2},"",""]
[4.12956823224612,{"$f":"_xlfn.CHISQ.DIST(A869,'Chi2-test af krydstabel'!$B$58,FALSE)","v":2.4901952175641503E-2},"",""]
[4.1343700557719876,{"$f":"_xlfn.CHISQ.DIST(A870,'Chi2-test af krydstabel'!$B$58,FALSE)","v":2.4827805923292617E-2},"",""]
[4.1391718792978551,{"$f":"_xlfn.CHISQ.DIST(A871,'Chi2-test af krydstabel'!$B$58,FALSE)","v":2.4753897139271386E-2},"",""]
[4.1439737028237227,{"$f":"_xlfn.CHISQ.DIST(A872,'Chi2-test af krydstabel'!$B$58,FALSE)","v":2.4680224978518784E-2},"",""]
[4.1487755263495902,{"$f":"_xlfn.CHISQ.DIST(A873,'Chi2-test af krydstabel'!$B$58,FALSE)","v":2.4606788599447503E-2},"",""]
[4.1535773498754578,{"$f":"_xlfn.CHISQ.DIST(A874,'Chi2-test af krydstabel'!$B$58,FALSE)","v":2.4533587163924953E-2},"",""]
[4.1583791734013253,{"$f":"_xlfn.CHISQ.DIST(A875,'Chi2-test af krydstabel'!$B$58,FALSE)","v":2.4460619837256319E-2},"",""]
[4.1631809969271929,{"$f":"_xlfn.CHISQ.DIST(A876,'Chi2-test af krydstabel'!$B$58,FALSE)","v":2.4387885788167762E-2},"",""]
[4.1679828204530605,{"$f":"_xlfn.CHISQ.DIST(A877,'Chi2-test af krydstabel'!$B$58,FALSE)","v":2.4315384188789736E-2},"",""]
[4.172784643978928,{"$f":"_xlfn.CHISQ.DIST(A878,'Chi2-test af krydstabel'!$B$58,FALSE)","v":2.4243114214640305E-2},"",""]
[4.1775864675047956,{"$f":"_xlfn.CHISQ.DIST(A879,'Chi2-test af krydstabel'!$B$58,FALSE)","v":2.4171075044608699E-2},"",""]
[4.1823882910306631,{"$f":"_xlfn.CHISQ.DIST(A880,'Chi2-test af krydstabel'!$B$58,FALSE)","v":2.409926586093886E-2},"",""]
[4.1871901145565307,{"$f":"_xlfn.CHISQ.DIST(A881,'Chi2-test af krydstabel'!$B$58,FALSE)","v":2.4027685849213113E-2},"",""]
[4.1919919380823982,{"$f":"_xlfn.CHISQ.DIST(A882,'Chi2-test af krydstabel'!$B$58,FALSE)","v":2.3956334198335972E-2},"",""]
[4.1967937616082658,{"$f":"_xlfn.CHISQ.DIST(A883,'Chi2-test af krydstabel'!$B$58,FALSE)","v":2.3885210100517952E-2},"",""]
[4.2015955851341333,{"$f":"_xlfn.CHISQ.DIST(A884,'Chi2-test af krydstabel'!$B$58,FALSE)","v":2.3814312751259611E-2},"",""]
[4.2063974086600009,{"$f":"_xlfn.CHISQ.DIST(A885,'Chi2-test af krydstabel'!$B$58,FALSE)","v":2.3743641349335532E-2},"",""]
[4.2111992321858684,{"$f":"_xlfn.CHISQ.DIST(A886,'Chi2-test af krydstabel'!$B$58,FALSE)","v":2.3673195096778517E-2},"",""]
[4.216001055711736,{"$f":"_xlfn.CHISQ.DIST(A887,'Chi2-test af krydstabel'!$B$58,FALSE)","v":2.3602973198863821E-2},"",""]
[4.2208028792376036,{"$f":"_xlfn.CHISQ.DIST(A888,'Chi2-test af krydstabel'!$B$58,FALSE)","v":2.3532974864093482E-2},"",""]
[4.2256047027634711,{"$f":"_xlfn.CHISQ.DIST(A889,'Chi2-test af krydstabel'!$B$58,FALSE)","v":2.3463199304180744E-2},"",""]
[4.2304065262893387,{"$f":"_xlfn.CHISQ.DIST(A890,'Chi2-test af krydstabel'!$B$58,FALSE)","v":2.3393645734034598E-2},"",""]
[4.2352083498152062,{"$f":"_xlfn.CHISQ.DIST(A891,'Chi2-test af krydstabel'!$B$58,FALSE)","v":2.3324313371744339E-2},"",""]
[4.2400101733410738,{"$f":"_xlfn.CHISQ.DIST(A892,'Chi2-test af krydstabel'!$B$58,FALSE)","v":2.3255201438564337E-2},"",""]
[4.2448119968669413,{"$f":"_xlfn.CHISQ.DIST(A893,'Chi2-test af krydstabel'!$B$58,FALSE)","v":2.318630915889873E-2},"",""]
[4.2496138203928089,{"$f":"_xlfn.CHISQ.DIST(A894,'Chi2-test af krydstabel'!$B$58,FALSE)","v":2.3117635760286397E-2},"",""]
[4.2544156439186764,{"$f":"_xlfn.CHISQ.DIST(A895,'Chi2-test af krydstabel'!$B$58,FALSE)","v":2.304918047338583E-2},"",""]
[4.259217467444544,{"$f":"_xlfn.CHISQ.DIST(A896,'Chi2-test af krydstabel'!$B$58,FALSE)","v":2.2980942531960227E-2},"",""]
[4.2640192909704115,{"$f":"_xlfn.CHISQ.DIST(A897,'Chi2-test af krydstabel'!$B$58,FALSE)","v":2.291292117286263E-2},"",""]
[4.2688211144962791,{"$f":"_xlfn.CHISQ.DIST(A898,'Chi2-test af krydstabel'!$B$58,FALSE)","v":2.2845115636021127E-2},"",""]
[4.2736229380221467,{"$f":"_xlfn.CHISQ.DIST(A899,'Chi2-test af krydstabel'!$B$58,FALSE)","v":2.2777525164424169E-2},"",""]
[4.2784247615480142,{"$f":"_xlfn.CHISQ.DIST(A900,'Chi2-test af krydstabel'!$B$58,FALSE)","v":2.2710149004105944E-2},"",""]
[4.2832265850738818,{"$f":"_xlfn.CHISQ.DIST(A901,'Chi2-test af krydstabel'!$B$58,FALSE)","v":2.264298640413186E-2},"",""]
[4.2880284085997493,{"$f":"_xlfn.CHISQ.DIST(A902,'Chi2-test af krydstabel'!$B$58,FALSE)","v":2.2576036616584128E-2},"",""]
[4.2928302321256169,{"$f":"_xlfn.CHISQ.DIST(A903,'Chi2-test af krydstabel'!$B$58,FALSE)","v":2.2509298896547337E-2},"",""]
[4.2976320556514844,{"$f":"_xlfn.CHISQ.DIST(A904,'Chi2-test af krydstabel'!$B$58,FALSE)","v":2.2442772502094241E-2},"",""]
[4.302433879177352,{"$f":"_xlfn.CHISQ.DIST(A905,'Chi2-test af krydstabel'!$B$58,FALSE)","v":2.2376456694271532E-2},{"$f":"IF($A905<$D$3,IF($A906>$D$3,MAX($B$9:$B$1009),\"\"),\"\")","v":""},{"$f":"IF($A905<$D$4,IF($A906>$D$4,MAX($B$9:$B$1009),\"\"),\"\")","v":""}]
[{"$f":"+A905+$B$4","v":4.3072357027032195},{"$f":"_xlfn.CHISQ.DIST(A906,'Chi2-test af krydstabel'!$B$58,FALSE)","v":2.2310350737085725E-2},"",""]
[4.3120375262290871,{"$f":"_xlfn.CHISQ.DIST(A907,'Chi2-test af krydstabel'!$B$58,FALSE)","v":2.2244453897489136E-2},"",""]
[4.3168393497549546,{"$f":"_xlfn.CHISQ.DIST(A908,'Chi2-test af krydstabel'!$B$58,FALSE)","v":2.217876544536591E-2},"",""]
[4.3216411732808222,{"$f":"_xlfn.CHISQ.DIST(A909,'Chi2-test af krydstabel'!$B$58,FALSE)","v":2.211328465351816E-2},"",""]
[4.3264429968066898,{"$f":"_xlfn.CHISQ.DIST(A910,'Chi2-test af krydstabel'!$B$58,FALSE)","v":2.2048010797652166E-2},"",""]
[4.3312448203325573,{"$f":"_xlfn.CHISQ.DIST(A911,'Chi2-test af krydstabel'!$B$58,FALSE)","v":2.1982943156364659E-2},"",""]
[4.3360466438584249,{"$f":"_xlfn.CHISQ.DIST(A912,'Chi2-test af krydstabel'!$B$58,FALSE)","v":2.191808101112918E-2},"",""]
[4.3408484673842924,{"$f":"_xlfn.CHISQ.DIST(A913,'Chi2-test af krydstabel'!$B$58,FALSE)","v":2.185342364628251E-2},"",""]
[4.34565029091016,{"$f":"_xlfn.CHISQ.DIST(A914,'Chi2-test af krydstabel'!$B$58,FALSE)","v":2.1788970349011203E-2},"",""]
[4.3504521144360275,{"$f":"_xlfn.CHISQ.DIST(A915,'Chi2-test af krydstabel'!$B$58,FALSE)","v":2.1724720409338157E-2},"",""]
[4.3552539379618951,{"$f":"_xlfn.CHISQ.DIST(A916,'Chi2-test af krydstabel'!$B$58,FALSE)","v":2.1660673120109292E-2},"",""]
[4.3600557614877626,{"$f":"_xlfn.CHISQ.DIST(A917,'Chi2-test af krydstabel'!$B$58,FALSE)","v":2.1596827776980285E-2},"",""]
[4.3648575850136302,{"$f":"_xlfn.CHISQ.DIST(A918,'Chi2-test af krydstabel'!$B$58,FALSE)","v":2.153318367840339E-2},"",""]
[4.3696594085394977,{"$f":"_xlfn.CHISQ.DIST(A919,'Chi2-test af krydstabel'!$B$58,FALSE)","v":2.1469740125614343E-2},"",""]
[4.3744612320653653,{"$f":"_xlfn.CHISQ.DIST(A920,'Chi2-test af krydstabel'!$B$58,FALSE)","v":2.1406496422619287E-2},"",""]
[4.3792630555912329,{"$f":"_xlfn.CHISQ.DIST(A921,'Chi2-test af krydstabel'!$B$58,FALSE)","v":2.1343451876181859E-2},"",""]
[4.3840648791171004,{"$f":"_xlfn.CHISQ.DIST(A922,'Chi2-test af krydstabel'!$B$58,FALSE)","v":2.1280605795810262E-2},"",""]
[4.388866702642968,{"$f":"_xlfn.CHISQ.DIST(A923,'Chi2-test af krydstabel'!$B$58,FALSE)","v":2.1217957493744465E-2},"",""]
[4.3936685261688355,{"$f":"_xlfn.CHISQ.DIST(A924,'Chi2-test af krydstabel'!$B$58,FALSE)","v":2.1155506284943455E-2},"",""]
[4.3984703496947031,{"$f":"_xlfn.CHISQ.DIST(A925,'Chi2-test af krydstabel'!$B$58,FALSE)","v":2.1093251487072577E-2},"",""]
[4.4032721732205706,{"$f":"_xlfn.CHISQ.DIST(A926,'Chi2-test af krydstabel'!$B$58,FALSE)","v":2.1031192420490889E-2},"",""]
[4.4080739967464382,{"$f":"_xlfn.CHISQ.DIST(A927,'Chi2-test af krydstabel'!$B$58,FALSE)","v":2.0969328408238692E-2},"",""]
[4.4128758202723057,{"$f":"_xlfn.CHISQ.DIST(A928,'Chi2-test af krydstabel'!$B$58,FALSE)","v":2.0907658776024997E-2},"",""]
[4.4176776437981733,{"$f":"_xlfn.CHISQ.DIST(A929,'Chi2-test af krydstabel'!$B$58,FALSE)","v":2.0846182852215199E-2},"",""]
[4.4224794673240408,{"$f":"_xlfn.CHISQ.DIST(A930,'Chi2-test af krydstabel'!$B$58,FALSE)","v":2.0784899967818692E-2},"",""]
[4.4272812908499084,{"$f":"_xlfn.CHISQ.DIST(A931,'Chi2-test af krydstabel'!$B$58,FALSE)","v":2.0723809456476665E-2},"",""]
[4.432083114375776,{"$f":"_xlfn.CHISQ.DIST(A932,'Chi2-test af krydstabel'!$B$58,FALSE)","v":2.0662910654449879E-2},"",""]
[4.4368849379016435,{"$f":"_xlfn.CHISQ.DIST(A933,'Chi2-test af krydstabel'!$B$58,FALSE)","v":2.0602202900606569E-2},"",""]
[4.4416867614275111,{"$f":"_xlfn.CHISQ.DIST(A934,'Chi2-test af krydstabel'!$B$58,FALSE)","v":2.0541685536410361E-2},"",""]
[4.4464885849533786,{"$f":"_xlfn.CHISQ.DIST(A935,'Chi2-test af krydstabel'!$B$58,FALSE)","v":2.0481357905908326E-2},"",""]
[4.4512904084792462,{"$f":"_xlfn.CHISQ.DIST(A936,'Chi2-test af krydstabel'!$B$58,FALSE)","v":2.0421219355719031E-2},"",""]
[4.4560922320051137,{"$f":"_xlfn.CHISQ.DIST(A937,'Chi2-test af krydstabel'!$B$58,FALSE)","v":2.0361269235020688E-2},"",""]
[4.4608940555309813,{"$f":"_xlfn.CHISQ.DIST(A938,'Chi2-test af krydstabel'!$B$58,FALSE)","v":2.0301506895539379E-2},"",""]
[4.4656958790568488,{"$f":"_xlfn.CHISQ.DIST(A939,'Chi2-test af krydstabel'!$B$58,FALSE)","v":2.0241931691537325E-2},"",""]
[4.4704977025827164,{"$f":"_xlfn.CHISQ.DIST(A940,'Chi2-test af krydstabel'!$B$58,FALSE)","v":2.0182542979801214E-2},"",""]
[4.4752995261085839,{"$f":"_xlfn.CHISQ.DIST(A941,'Chi2-test af krydstabel'!$B$58,FALSE)","v":2.0123340119630625E-2},"",""]
[4.4801013496344515,{"$f":"_xlfn.CHISQ.DIST(A942,'Chi2-test af krydstabel'!$B$58,FALSE)","v":2.0064322472826492E-2},"",""]
[4.4849031731603191,{"$f":"_xlfn.CHISQ.DIST(A943,'Chi2-test af krydstabel'!$B$58,FALSE)","v":2.0005489403679626E-2},"",""]
[4.4897049966861866,{"$f":"_xlfn.CHISQ.DIST(A944,'Chi2-test af krydstabel'!$B$58,FALSE)","v":1.9946840278959325E-2},"",""]
[4.4945068202120542,{"$f":"_xlfn.CHISQ.DIST(A945,'Chi2-test af krydstabel'!$B$58,FALSE)","v":1.9888374467902002E-2},"",""]
[4.4993086437379217,{"$f":"_xlfn.CHISQ.DIST(A946,'Chi2-test af krydstabel'!$B$58,FALSE)","v":1.9830091342199957E-2},"",""]
[4.5041104672637893,{"$f":"_xlfn.CHISQ.DIST(A947,'Chi2-test af krydstabel'!$B$58,FALSE)","v":1.9771990275990102E-2},"",""]
[4.5089122907896568,{"$f":"_xlfn.CHISQ.DIST(A948,'Chi2-test af krydstabel'!$B$58,FALSE)","v":1.9714070645842838E-2},"",""]
[4.5137141143155244,{"$f":"_xlfn.CHISQ.DIST(A949,'Chi2-test af krydstabel'!$B$58,FALSE)","v":1.9656331830750936E-2},"",""]
[4.5185159378413919,{"$f":"_xlfn.CHISQ.DIST(A950,'Chi2-test af krydstabel'!$B$58,FALSE)","v":1.9598773212118531E-2},"",""]
[4.5233177613672595,{"$f":"_xlfn.CHISQ.DIST(A951,'Chi2-test af krydstabel'!$B$58,FALSE)","v":1.9541394173750112E-2},"",""]
[4.528119584893127,{"$f":"_xlfn.CHISQ.DIST(A952,'Chi2-test af krydstabel'!$B$58,FALSE)","v":1.9484194101839623E-2},"",""]
[4.5329214084189946,{"$f":"_xlfn.CHISQ.DIST(A953,'Chi2-test af krydstabel'!$B$58,FALSE)","v":1.9427172384959602E-2},"",""]
[4.5377232319448622,{"$f":"_xlfn.CHISQ.DIST(A954,'Chi2-test af krydstabel'!$B$58,FALSE)","v":1.9370328414050383E-2},"",""]
[4.5425250554707297,{"$f":"_xlfn.CHISQ.DIST(A955,'Chi2-test af krydstabel'!$B$58,FALSE)","v":1.9313661582409353E-2},"",""]
[4.5473268789965973,{"$f":"_xlfn.CHISQ.DIST(A956,'Chi2-test af krydstabel'!$B$58,FALSE)","v":1.9257171285680278E-2},"",""]
[4.5521287025224648,{"$f":"_xlfn.CHISQ.DIST(A957,'Chi2-test af krydstabel'!$B$58,FALSE)","v":1.9200856921842677E-2},"",""]
[4.5569305260483324,{"$f":"_xlfn.CHISQ.DIST(A958,'Chi2-test af krydstabel'!$B$58,FALSE)","v":1.914471789120125E-2},"",""]
[4.5617323495741999,{"$f":"_xlfn.CHISQ.DIST(A959,'Chi2-test af krydstabel'!$B$58,FALSE)","v":1.9088753596375352E-2},"",""]
[4.5665341731000675,{"$f":"_xlfn.CHISQ.DIST(A960,'Chi2-test af krydstabel'!$B$58,FALSE)","v":1.9032963442288584E-2},"",""]
[4.571335996625935,{"$f":"_xlfn.CHISQ.DIST(A961,'Chi2-test af krydstabel'!$B$58,FALSE)","v":1.897734683615836E-2},"",""]
[4.5761378201518026,{"$f":"_xlfn.CHISQ.DIST(A962,'Chi2-test af krydstabel'!$B$58,FALSE)","v":1.8921903187485579E-2},"",""]
[4.5809396436776701,{"$f":"_xlfn.CHISQ.DIST(A963,'Chi2-test af krydstabel'!$B$58,FALSE)","v":1.8866631908044329E-2},"",""]
[4.5857414672035377,{"$f":"_xlfn.CHISQ.DIST(A964,'Chi2-test af krydstabel'!$B$58,FALSE)","v":1.8811532411871688E-2},"",""]
[4.5905432907294053,{"$f":"_xlfn.CHISQ.DIST(A965,'Chi2-test af krydstabel'!$B$58,FALSE)","v":1.8756604115257498E-2},"",""]
[4.5953451142552728,{"$f":"_xlfn.CHISQ.DIST(A966,'Chi2-test af krydstabel'!$B$58,FALSE)","v":1.8701846436734289E-2},"",""]
[4.6001469377811404,{"$f":"_xlfn.CHISQ.DIST(A967,'Chi2-test af krydstabel'!$B$58,FALSE)","v":1.86472587970672E-2},"",""]
[4.6049487613070079,{"$f":"_xlfn.CHISQ.DIST(A968,'Chi2-test af krydstabel'!$B$58,FALSE)","v":1.8592840619243951E-2},"",""]
[4.6097505848328755,{"$f":"_xlfn.CHISQ.DIST(A969,'Chi2-test af krydstabel'!$B$58,FALSE)","v":1.8538591328464912E-2},{"$f":"IF($A969<$D$3,IF($A970>$D$3,MAX($B$9:$B$1009),\"\"),\"\")","v":""},{"$f":"IF($A969<$D$4,IF($A970>$D$4,MAX($B$9:$B$1009),\"\"),\"\")","v":""}]
[{"$f":"+A969+$B$4","v":4.614552408358743},{"$f":"_xlfn.CHISQ.DIST(A970,'Chi2-test af krydstabel'!$B$58,FALSE)","v":1.8484510352133166E-2},"",""]
[4.6193542318846106,{"$f":"_xlfn.CHISQ.DIST(A971,'Chi2-test af krydstabel'!$B$58,FALSE)","v":1.8430597119844676E-2},"",""]
[4.6241560554104781,{"$f":"_xlfn.CHISQ.DIST(A972,'Chi2-test af krydstabel'!$B$58,FALSE)","v":1.837685106337849E-2},"",""]
[4.6289578789363457,{"$f":"_xlfn.CHISQ.DIST(A973,'Chi2-test af krydstabel'!$B$58,FALSE)","v":1.8323271616686961E-2},"",""]
[4.6337597024622132,{"$f":"_xlfn.CHISQ.DIST(A974,'Chi2-test af krydstabel'!$B$58,FALSE)","v":1.8269858215886083E-2},"",""]
[4.6385615259880808,{"$f":"_xlfn.CHISQ.DIST(A975,'Chi2-test af krydstabel'!$B$58,FALSE)","v":1.8216610299245845E-2},"",""]
[4.6433633495139484,{"$f":"_xlfn.CHISQ.DIST(A976,'Chi2-test af krydstabel'!$B$58,FALSE)","v":1.8163527307180603E-2},"",""]
[4.6481651730398159,{"$f":"_xlfn.CHISQ.DIST(A977,'Chi2-test af krydstabel'!$B$58,FALSE)","v":1.8110608682239574E-2},"",""]
[4.6529669965656835,{"$f":"_xlfn.CHISQ.DIST(A978,'Chi2-test af krydstabel'!$B$58,FALSE)","v":1.8057853869097331E-2},"",""]
[4.657768820091551,{"$f":"_xlfn.CHISQ.DIST(A979,'Chi2-test af krydstabel'!$B$58,FALSE)","v":1.8005262314544343E-2},"",""]
[4.6625706436174186,{"$f":"_xlfn.CHISQ.DIST(A980,'Chi2-test af krydstabel'!$B$58,FALSE)","v":1.7952833467477614E-2},"",""]
[4.6673724671432861,{"$f":"_xlfn.CHISQ.DIST(A981,'Chi2-test af krydstabel'!$B$58,FALSE)","v":1.7900566778891319E-2},"",""]
[4.6721742906691537,{"$f":"_xlfn.CHISQ.DIST(A982,'Chi2-test af krydstabel'!$B$58,FALSE)","v":1.7848461701867505E-2},"",""]
[4.6769761141950212,{"$f":"_xlfn.CHISQ.DIST(A983,'Chi2-test af krydstabel'!$B$58,FALSE)","v":1.7796517691566874E-2},"",""]
[4.6817779377208888,{"$f":"_xlfn.CHISQ.DIST(A984,'Chi2-test af krydstabel'!$B$58,FALSE)","v":1.7744734205219551E-2},"",""]
[4.6865797612467563,{"$f":"_xlfn.CHISQ.DIST(A985,'Chi2-test af krydstabel'!$B$58,FALSE)","v":1.7693110702115957E-2},"",""]
[4.6913815847726239,{"$f":"_xlfn.CHISQ.DIST(A986,'Chi2-test af krydstabel'!$B$58,FALSE)","v":1.7641646643597724E-2},"",""]
[4.6961834082984915,{"$f":"_xlfn.CHISQ.DIST(A987,'Chi2-test af krydstabel'!$B$58,FALSE)","v":1.7590341493048597E-2},"",""]
[4.700985231824359,{"$f":"_xlfn.CHISQ.DIST(A988,'Chi2-test af krydstabel'!$B$58,FALSE)","v":1.7539194715885473E-2},"",""]
[4.7057870553502266,{"$f":"_xlfn.CHISQ.DIST(A989,'Chi2-test af krydstabel'!$B$58,FALSE)","v":1.7488205779549439E-2},"",""]
[4.7105888788760941,{"$f":"_xlfn.CHISQ.DIST(A990,'Chi2-test af krydstabel'!$B$58,FALSE)","v":1.7437374153496811E-2},"",""]
[4.7153907024019617,{"$f":"_xlfn.CHISQ.DIST(A991,'Chi2-test af krydstabel'!$B$58,FALSE)","v":1.7386699309190349E-2},"",""]
[4.7201925259278292,{"$f":"_xlfn.CHISQ.DIST(A992,'Chi2-test af krydstabel'!$B$58,FALSE)","v":1.7336180720090379E-2},"",""]
[4.7249943494536968,{"$f":"_xlfn.CHISQ.DIST(A993,'Chi2-test af krydstabel'!$B$58,FALSE)","v":1.7285817861646045E-2},"",""]
[4.7297961729795643,{"$f":"_xlfn.CHISQ.DIST(A994,'Chi2-test af krydstabel'!$B$58,FALSE)","v":1.7235610211286577E-2},"",""]
[4.7345979965054319,{"$f":"_xlfn.CHISQ.DIST(A995,'Chi2-test af krydstabel'!$B$58,FALSE)","v":1.7185557248412611E-2},"",""]
[4.7393998200312994,{"$f":"_xlfn.CHISQ.DIST(A996,'Chi2-test af krydstabel'!$B$58,FALSE)","v":1.7135658454387553E-2},"",""]
[4.744201643557167,{"$f":"_xlfn.CHISQ.DIST(A997,'Chi2-test af krydstabel'!$B$58,FALSE)","v":1.7085913312529E-2},"",""]
[4.7490034670830346,{"$f":"_xlfn.CHISQ.DIST(A998,'Chi2-test af krydstabel'!$B$58,FALSE)","v":1.7036321308100164E-2},"",""]
[4.7538052906089021,{"$f":"_xlfn.CHISQ.DIST(A999,'Chi2-test af krydstabel'!$B$58,FALSE)","v":1.6986881928301407E-2},"",""]
[4.7586071141347697,{"$f":"_xlfn.CHISQ.DIST(A1000,'Chi2-test af krydstabel'!$B$58,FALSE)","v":1.6937594662261746E-2},"",""]
[4.7634089376606372,{"$f":"_xlfn.CHISQ.DIST(A1001,'Chi2-test af krydstabel'!$B$58,FALSE)","v":1.6888459001030483E-2},"",""]
[4.7682107611865048,{"$f":"_xlfn.CHISQ.DIST(A1002,'Chi2-test af krydstabel'!$B$58,FALSE)","v":1.6839474437568783E-2},"",""]
[4.7730125847123723,{"$f":"_xlfn.CHISQ.DIST(A1003,'Chi2-test af krydstabel'!$B$58,FALSE)","v":1.6790640466741391E-2},"",""]
[4.7778144082382399,{"$f":"_xlfn.CHISQ.DIST(A1004,'Chi2-test af krydstabel'!$B$58,FALSE)","v":1.6741956585308325E-2},"",""]
[4.7826162317641074,{"$f":"_xlfn.CHISQ.DIST(A1005,'Chi2-test af krydstabel'!$B$58,FALSE)","v":1.6693422291916629E-2},"",""]
[4.787418055289975,{"$f":"_xlfn.CHISQ.DIST(A1006,'Chi2-test af krydstabel'!$B$58,FALSE)","v":1.6645037087092196E-2},"",""]
[4.7922198788158425,{"$f":"_xlfn.CHISQ.DIST(A1007,'Chi2-test af krydstabel'!$B$58,FALSE)","v":1.6596800473231591E-2},"",""]
[4.7970217023417101,{"$f":"_xlfn.CHISQ.DIST(A1008,'Chi2-test af krydstabel'!$B$58,FALSE)","v":1.6548711954593946E-2},"",""]
[4.8018235258675777,{"$f":"_xlfn.CHISQ.DIST(A1009,'Chi2-test af krydstabel'!$B$58,FALSE)","v":1.6500771037292875E-2},"",""]

{"sheet":"Chi2-simulator","index":14,"n_rows":39,"n_cols":32,"rows_kept":39,"cut":false,"hidden":false,"merged":[[36,2,36,12],[1,2,1,3],[1,7,1,10],[38,2,38,12]]}
[]
[null,"Ønsket grad af afhængighed","Meget svag",null,null,null,null,"Tilbage til hovedmenuen",null,null,null,null,null,null,null,null,null,null,null,null,{"$f":"VLOOKUP($C$2,$AB$3:$AC$6,2,FALSE)","v":2}]
[null,null,null,null,null,null,null,null,null,null,null,null,null,null,null,null,null,null,null,null,null,null,null,null,null,null,null,"Ingen",1]
[null,"Observerede Værdier",null,null,null,null,null,null,null,null,null,null,null,null,null,null,null,null,null,null,null,1,2,3,4,null,null,"Meget svag",2]
[null,null,"Meget lav","Lav","Høj","Meget høj","I alt",null,null,null,null,null,null,null,null,null,null,null,null,null,null,{"$f":"+V4+4","v":5},{"$f":"+W4+4","v":6},7,8,null,null,"Moderat",3]
[null,"Meget lav",{"$f":"INDEX($V$11:$Y$26,MATCH(V4,$U$11:$U$26),MATCH($U$2,$V$10:$Y$10))","v":107},106,89,80,{"$f":"SUM(C6:F6)","v":382},null,null,null,null,null,null,null,null,null,null,null,null,null,null,{"$f":"+V5+4","v":9},{"$f":"+W5+4","v":10},{"$f":"+X5+4","v":11},{"$f":"+Y5+4","v":12},null,null,"Stærk",4]
[null,"Lav",107,107,105,89,{"$f":"SUM(C7:F7)","v":408},null,null,null,null,null,null,null,null,null,null,null,null,null,null,13,14,15,16]
[null,"Høj",90,105,108,107,{"$f":"SUM(C8:F8)","v":410}]
[null,"Meget høj",80,90,105,109,{"$f":"SUM(C9:F9)","v":384}]
[null,"I alt",{"$f":"SUM(C6:C9)","v":384},{"$f":"SUM(D6:D9)","v":408},{"$f":"SUM(E6:E9)","v":407},{"$f":"SUM(F6:F9)","v":385},{"$f":"SUM(C10:F10)","v":1584},null,null,null,null,null,null,null,null,null,null,null,null,null,null,1,2,3,4]
[null,null,null,null,null,null,null,null,null,null,null,null,null,null,null,null,null,null,null,null,1,{"$f":"RANDBETWEEN(108,112)","v":108},{"$f":"RANDBETWEEN(107,109)","v":107},{"$f":"RANDBETWEEN(110,112)","v":111},{"$f":"RANDBETWEEN(120,130)","v":120}]
[null,"Forventede værdier",null,null,null,null,null,null,null,null,null,null,null,null,null,null,null,null,null,null,2,{"$f":"RANDBETWEEN(103,107)","v":103},{"$f":"RANDBETWEEN(105,107)","v":106},{"$f":"RANDBETWEEN(107,109)","v":107},{"$f":"RANDBETWEEN(90,100)","v":96}]
[null,null,"Meget lav","Lav","Høj","Meget høj","I alt",null,null,null,null,null,null,null,null,null,null,null,null,null,3,{"$f":"RANDBETWEEN(98,102)","v":101},{"$f":"RANDBETWEEN(89,90)","v":89},{"$f":"RANDBETWEEN(89,90)","v":90},{"$f":"RANDBETWEEN(85,95)","v":94}]
[null,"Meget lav",{"$f":"+$G6*C$10/$G$10","v":92.606060606060609},98.393939393939391,98.152777777777771,92.847222222222229,{"$f":"SUM(C14:F14)","v":382},null,null,null,null,null,null,null,null,null,null,null,null,null,4,{"$f":"RANDBETWEEN(95,100)","v":95},{"$f":"RANDBETWEEN(80,81)","v":80},{"$f":"RANDBETWEEN(80,81)","v":81},{"$f":"RANDBETWEEN(80,90)","v":81},null,null,120,100,90,85,{"$f":"SUM(AB14:AE14)","v":395}]
[null,"Lav",98.909090909090907,105.09090909090909,104.83333333333333,99.166666666666671,{"$f":"SUM(C15:F15)","v":408},null,null,null,null,null,null,null,null,null,null,null,null,null,5,{"$f":"RANDBETWEEN(100,110)","v":104},{"$f":"RANDBETWEEN(105,107)","v":107},{"$f":"RANDBETWEEN(107,109)","v":108},{"$f":"RANDBETWEEN(90,100)","v":91},null,null,{"$f":"+AC14","v":100},{"$f":"+AB14","v":120},{"$f":"+AC14","v":100},{"$f":"+AD14","v":90},{"$f":"SUM(AB15:AE15)","v":410}]
[null,"Høj",99.393939393939391,105.60606060606061,105.34722222222223,99.652777777777771,{"$f":"SUM(C16:F16)","v":410},null,null,null,null,null,null,null,null,null,null,null,null,null,6,{"$f":"RANDBETWEEN(108,112)","v":108},{"$f":"RANDBETWEEN(107,109)","v":107},{"$f":"RANDBETWEEN(110,112)","v":112},{"$f":"RANDBETWEEN(120,130)","v":126},null,null,{"$f":"+AD14","v":90},{"$f":"+AC14","v":100},{"$f":"+AC15","v":120},{"$f":"+AD15","v":100},{"$f":"SUM(AB16:AE16)","v":410}]
[null,"Meget høj",93.090909090909093,98.909090909090907,98.666666666666671,93.333333333333329,{"$f":"SUM(C17:F17)","v":384},null,null,null,null,null,null,null,null,null,null,null,null,null,7,{"$f":"RANDBETWEEN(103,107)","v":104},{"$f":"RANDBETWEEN(105,107)","v":105},{"$f":"RANDBETWEEN(107,109)","v":107},{"$f":"RANDBETWEEN(90,100)","v":94},null,null,{"$f":"+AE14","v":85},{"$f":"+AE15","v":90},{"$f":"+AC14","v":100},{"$f":"+AD16","v":120},{"$f":"SUM(AB17:AE17)","v":395}]
[null,"I alt",{"$f":"SUM(C14:C17)","v":384},{"$f":"SUM(D14:D17)","v":408},{"$f":"SUM(E14:E17)","v":407},{"$f":"SUM(F14:F17)","v":385},{"$f":"SUM(C18:F18)","v":1584},null,null,null,null,null,null,null,null,null,null,null,null,null,8,{"$f":"RANDBETWEEN(98,102)","v":99},{"$f":"RANDBETWEEN(89,90)","v":89},90,{"$f":"RANDBETWEEN(85,95)","v":92},null,null,{"$f":"SUM(AB14:AB17)","v":395},{"$f":"SUM(AC14:AC17)","v":410},{"$f":"SUM(AD14:AD17)","v":410},{"$f":"SUM(AE14:AE17)","v":395},{"$f":"SUM(AB18:AE18)","v":1610}]
[null,null,null,null,null,null,null,null,null,null,null,null,null,null,null,null,null,null,null,null,9,98,90,90,91]
[null,"Chi2-værdier",null,null,null,null,null,null,null,null,null,null,null,null,null,null,null,null,null,null,10,{"$f":"RANDBETWEEN(103,107)","v":107},{"$f":"RANDBETWEEN(105,107)","v":105},{"$f":"RANDBETWEEN(107,109)","v":109},{"$f":"RANDBETWEEN(90,100)","v":96}]
[null,null,"Meget lav","Lav","Høj","Meget høj","I alt",null,null,null,null,null,null,null,null,null,null,null,null,null,11,{"$f":"RANDBETWEEN(108,112)","v":111},{"$f":"RANDBETWEEN(107,109)","v":108},{"$f":"RANDBETWEEN(110,112)","v":110},{"$f":"RANDBETWEEN(120,130)","v":124}]
[null,"Meget lav",{"$f":"(C6-C14)^2/C14","v":2.2372778835475162},0.5879646480200843,0.85349944185022597,1.7776635086844526,{"$f":"SUM(C22:F22)","v":5.4564054821022792},null,null,null,null,null,null,null,null,null,null,null,null,null,12,{"$f":"RANDBETWEEN(103,107)","v":107},{"$f":"RANDBETWEEN(105,107)","v":107},{"$f":"RANDBETWEEN(105,107)","v":107},{"$f":"RANDBETWEEN(90,100)","v":98}]
[null,"Lav",0.66184826203208602,3.4680717206668668E-2,2.6497085320616241E-4,1.042296918767508,{"$f":"SUM(C23:F23)","v":1.7390908688594688},null,null,null,null,null,null,null,null,null,null,null,null,null,13,{"$f":"RANDBETWEEN(95,100)","v":100},{"$f":"RANDBETWEEN(80,81)","v":80},{"$f":"RANDBETWEEN(80,81)","v":81},{"$f":"RANDBETWEEN(80,90)","v":87}]
[null,"Høj",0.88784183296378372,3.4781096474066687E-3,6.6800336922287817E-2,0.54169763840495644,{"$f":"SUM(C24:F24)","v":1.4998179179384348},null,null,null,null,null,null,null,null,null,null,null,null,null,14,{"$f":"RANDBETWEEN(98,102)","v":101},{"$f":"RANDBETWEEN(89,90)","v":90},{"$f":"RANDBETWEEN(89,90)","v":89},{"$f":"RANDBETWEEN(85,95)","v":94}]
[null,"Meget høj",1.8409090909090915,0.80247326203208513,0.40653153153153088,2.6297619047619065,{"$f":"SUM(C25:F25)","v":5.6796757892346141},null,null,null,null,null,null,null,null,null,null,null,null,null,15,{"$f":"RANDBETWEEN(103,107)","v":104},{"$f":"RANDBETWEEN(105,107)","v":105},{"$f":"RANDBETWEEN(107,109)","v":107},{"$f":"RANDBETWEEN(90,100)","v":97}]
[null,"I alt",{"$f":"SUM(C22:C25)","v":5.6278770694524773},{"$f":"SUM(D22:D25)","v":1.4285967369062447},{"$f":"SUM(E22:E25)","v":1.3270962811572509},{"$f":"SUM(F22:F25)","v":5.9914199706188231},{"$f":"SUM(C26:F26)","v":14.374990058134797},null,null,null,null,null,null,null,null,null,null,null,null,null,16,{"$f":"RANDBETWEEN(108,112)","v":108},{"$f":"RANDBETWEEN(107,109)","v":109},{"$f":"RANDBETWEEN(110,112)","v":111},{"$f":"RANDBETWEEN(120,130)","v":121}]
[null,null,null,null,null,null,null,null,null,null,null,null,null,null,null,null,null,null,null,null,null,{"$f":"SUM(V11:V26)","v":1658},{"$f":"SUM(W11:W26)","v":1584},{"$f":"SUM(X11:X26)","v":1610},{"$f":"SUM(Y11:Y26)","v":1602}]
[null,"Hypoteser:"]
[null,"H0: Der er ingen afhængighed mellem de to variable"]
[null,"H1: Der er afhængighed mellem de to variable"]
[]
[null,"Signifikansniveau a:",0.05]
[null,"Teststørrelse",{"$f":"+G26","v":14.374990058134797}]
[null,"Frihedsgrader",{"$f":"(COUNTA(C21:F21)-1)*(COUNTA(B22:B25)-1)","v":9}]
[null,"P-værdi",{"$f":"CHITEST($C$6:$F$9,$C$14:$F$17)","v":0.10959740493530271}]
[]
[null,"Konklusion:",{"$f":"IF($C$35<$C$32, \"Nullhypotesen forkastes, der er afhængighed!\", \"Nullhypotesen forkastes ikke, der er ikke afhængighed!\")","v":"Nullhypotesen forkastes ikke, der er ikke afhængighed!"}]
[]
[null,null,{"$f":"IF($C$35<$C$32, \"Er der også kausalitet/årsagssammenhæng?\", \"\")","v":""}]

{"sheet":"Regressionsanalyse","index":15,"n_rows":32,"n_cols":15,"rows_kept":32,"cut":false,"hidden":false,"merged":[[1,14,1,17],[1,4,1,8]]}
["Data Labels","Data til x-akse ","Data til y-akse "]
[null,1,1,null,"Regressionsanalyse",null,null,null,null,null,null,null,null,null,"Tilbage til hovedmenuen"]
[null,2,2]
[null,3,3]
[null,4,4]
[null,5,5]
[null,6,6]
[null,6,6]
[]
[]
[]
[]
[]
[]
[]
[]
[]
[]
[]
[]
[]
[]
[]
[]
[]
[]
[]
[null,null,null,null,null,null,"Y-akseskæring",{"$f":"IF(B2=\"\",\"\",INTERCEPT(C2:C2520,B2:B2520))","v":0}]
[null,null,null,null,null,null,"Hældningskoefficient",{"$f":"IF(B2=\"\",\"\",SLOPE(C2:C2520,B2:B2520))","v":1}]
[null,null,null,null,null,null,"R2",{"$f":"IF(B2=\"\",\"\",RSQ(C2:C2520,B2:B2520))","v":1},null,{"$f":"IF(B2=\"\",\"\",IF($H$30>0.9,\"Meget stærk samvariation\",IF($H$30>0.8,\"Stærk samvariation\",IF($H$30>0.5,\"Moderat samvariation\",IF($H$30>0.3,\"Svag samvariation\",\"Ringe samvariation\")))))","v":"Meget stærk samvariation"}]
[]
[null,null,null,null,null,null,null,null,null,{"$f":"IF(J30=\"\",\"\",\"Hvis der er samvariation: er der også en årsagssammenhæng?\")","v":"Hvis der er samvariation: er der også en årsagssammenhæng?"}]

{"sheet":"Regressionssimulator","index":16,"n_rows":104,"n_cols":9,"rows_kept":104,"cut":false,"hidden":false,"merged":[[5,8,5,11],[0,0,0,12]]}
["R2-simulator"]
[]
[null,null,null,"Vælg den ønskede styrke ved at benytte rullefeltet i den grønne celle"]
["X","Y"]
[{"$f":"RANDBETWEEN(0,100)","v":74},{"$f":"IF($G$6=\"Ingen\", 'R-square_help'!A2,Regressionssimulator!A5*'R-square_help'!C2+'R-square_help'!B2)","v":82}]
[{"$f":"RANDBETWEEN(0,100)","v":89},{"$f":"IF($G$6=\"Ingen\", 'R-square_help'!A3,Regressionssimulator!A6*'R-square_help'!C3+'R-square_help'!B3)","v":97},null,null,null,"Styrke","Ingen",null,"Tilbage til hovedmenuen"]
[22,{"$f":"IF($G$6=\"Ingen\", 'R-square_help'!A4,Regressionssimulator!A7*'R-square_help'!C4+'R-square_help'!B4)","v":4}]
[49,{"$f":"IF($G$6=\"Ingen\", 'R-square_help'!A5,Regressionssimulator!A8*'R-square_help'!C5+'R-square_help'!B5)","v":67},null,null,null,{"$f":"\"Korrelationskoefficient = \"&ROUND(CORREL(A4:A104,B4:B104),3)","v":"Korrelationskoefficient = -0.03"}]
[33,{"$f":"IF($G$6=\"Ingen\", 'R-square_help'!A6,Regressionssimulator!A9*'R-square_help'!C6+'R-square_help'!B6)","v":73}]
[80,{"$f":"IF($G$6=\"Ingen\", 'R-square_help'!A7,Regressionssimulator!A10*'R-square_help'!C7+'R-square_help'!B7)","v":14}]
[79,{"$f":"IF($G$6=\"Ingen\", 'R-square_help'!A8,Regressionssimulator!A11*'R-square_help'!C8+'R-square_help'!B8)","v":96}]
[68,{"$f":"IF($G$6=\"Ingen\", 'R-square_help'!A9,Regressionssimulator!A12*'R-square_help'!C9+'R-square_help'!B9)","v":21}]
[30,{"$f":"IF($G$6=\"Ingen\", 'R-square_help'!A10,Regressionssimulator!A13*'R-square_help'!C10+'R-square_help'!B10)","v":45}]
[3,{"$f":"IF($G$6=\"Ingen\", 'R-square_help'!A11,Regressionssimulator!A14*'R-square_help'!C11+'R-square_help'!B11)","v":63}]
[66,{"$f":"IF($G$6=\"Ingen\", 'R-square_help'!A12,Regressionssimulator!A15*'R-square_help'!C12+'R-square_help'!B12)","v":8}]
[20,{"$f":"IF($G$6=\"Ingen\", 'R-square_help'!A13,Regressionssimulator!A16*'R-square_help'!C13+'R-square_help'!B13)","v":43}]
[36,{"$f":"IF($G$6=\"Ingen\", 'R-square_help'!A14,Regressionssimulator!A17*'R-square_help'!C14+'R-square_help'!B14)","v":95}]
[62,{"$f":"IF($G$6=\"Ingen\", 'R-square_help'!A15,Regressionssimulator!A18*'R-square_help'!C15+'R-square_help'!B15)","v":78}]
[86,{"$f":"IF($G$6=\"Ingen\", 'R-square_help'!A16,Regressionssimulator!A19*'R-square_help'!C16+'R-square_help'!B16)","v":94}]
[49,{"$f":"IF($G$6=\"Ingen\", 'R-square_help'!A17,Regressionssimulator!A20*'R-square_help'!C17+'R-square_help'!B17)","v":44}]
[13,{"$f":"IF($G$6=\"Ingen\", 'R-square_help'!A18,Regressionssimulator!A21*'R-square_help'!C18+'R-square_help'!B18)","v":51}]
[14,{"$f":"IF($G$6=\"Ingen\", 'R-square_help'!A19,Regressionssimulator!A22*'R-square_help'!C19+'R-square_help'!B19)","v":39}]
[72,{"$f":"IF($G$6=\"Ingen\", 'R-square_help'!A20,Regressionssimulator!A23*'R-square_help'!C20+'R-square_help'!B20)","v":11}]
[80,{"$f":"IF($G$6=\"Ingen\", 'R-square_help'!A21,Regressionssimulator!A24*'R-square_help'!C21+'R-square_help'!B21)","v":62}]
[91,{"$f":"IF($G$6=\"Ingen\", 'R-square_help'!A22,Regressionssimulator!A25*'R-square_help'!C22+'R-square_help'!B22)","v":0}]
[87,{"$f":"IF($G$6=\"Ingen\", 'R-square_help'!A23,Regressionssimulator!A26*'R-square_help'!C23+'R-square_help'!B23)","v":74}]
[69,{"$f":"IF($G$6=\"Ingen\", 'R-square_help'!A24,Regressionssimulator!A27*'R-square_help'!C24+'R-square_help'!B24)","v":18}]
[71,{"$f":"IF($G$6=\"Ingen\", 'R-square_help'!A25,Regressionssimulator!A28*'R-square_help'!C25+'R-square_help'!B25)","v":29}]
[53,{"$f":"IF($G$6=\"Ingen\", 'R-square_help'!A26,Regressionssimulator!A29*'R-square_help'!C26+'R-square_help'!B26)","v":16}]
[28,{"$f":"IF($G$6=\"Ingen\", 'R-square_help'!A27,Regressionssimulator!A30*'R-square_help'!C27+'R-square_help'!B27)","v":30}]
[1,{"$f":"IF($G$6=\"Ingen\", 'R-square_help'!A28,Regressionssimulator!A31*'R-square_help'!C28+'R-square_help'!B28)","v":78}]
[19,{"$f":"IF($G$6=\"Ingen\", 'R-square_help'!A29,Regressionssimulator!A32*'R-square_help'!C29+'R-square_help'!B29)","v":52}]
[34,{"$f":"IF($G$6=\"Ingen\", 'R-square_help'!A30,Regressionssimulator!A33*'R-square_help'!C30+'R-square_help'!B30)","v":92}]
[90,{"$f":"IF($G$6=\"Ingen\", 'R-square_help'!A31,Regressionssimulator!A34*'R-square_help'!C31+'R-square_help'!B31)","v":76}]
[1,{"$f":"IF($G$6=\"Ingen\", 'R-square_help'!A32,Regressionssimulator!A35*'R-square_help'!C32+'R-square_help'!B32)","v":43}]
[50,{"$f":"IF($G$6=\"Ingen\", 'R-square_help'!A33,Regressionssimulator!A36*'R-square_help'!C33+'R-square_help'!B33)","v":48}]
[12,{"$f":"IF($G$6=\"Ingen\", 'R-square_help'!A34,Regressionssimulator!A37*'R-square_help'!C34+'R-square_help'!B34)","v":49}]
[60,{"$f":"IF($G$6=\"Ingen\", 'R-square_help'!A35,Regressionssimulator!A38*'R-square_help'!C35+'R-square_help'!B35)","v":97}]
[4,{"$f":"IF($G$6=\"Ingen\", 'R-square_help'!A36,Regressionssimulator!A39*'R-square_help'!C36+'R-square_help'!B36)","v":70}]
[47,{"$f":"IF($G$6=\"Ingen\", 'R-square_help'!A37,Regressionssimulator!A40*'R-square_help'!C37+'R-square_help'!B37)","v":7}]
[40,{"$f":"IF($G$6=\"Ingen\", 'R-square_help'!A38,Regressionssimulator!A41*'R-square_help'!C38+'R-square_help'!B38)","v":81}]
[45,{"$f":"IF($G$6=\"Ingen\", 'R-square_help'!A39,Regressionssimulator!A42*'R-square_help'!C39+'R-square_help'!B39)","v":1}]
[82,{"$f":"IF($G$6=\"Ingen\", 'R-square_help'!A40,Regressionssimulator!A43*'R-square_help'!C40+'R-square_help'!B40)","v":85}]
[54,{"$f":"IF($G$6=\"Ingen\", 'R-square_help'!A41,Regressionssimulator!A44*'R-square_help'!C41+'R-square_help'!B41)","v":61}]
[36,{"$f":"IF($G$6=\"Ingen\", 'R-square_help'!A42,Regressionssimulator!A45*'R-square_help'!C42+'R-square_help'!B42)","v":91}]
[43,{"$f":"IF($G$6=\"Ingen\", 'R-square_help'!A43,Regressionssimulator!A46*'R-square_help'!C43+'R-square_help'!B43)","v":80}]
[63,{"$f":"IF($G$6=\"Ingen\", 'R-square_help'!A44,Regressionssimulator!A47*'R-square_help'!C44+'R-square_help'!B44)","v":24}]
[53,{"$f":"IF($G$6=\"Ingen\", 'R-square_help'!A45,Regressionssimulator!A48*'R-square_help'!C45+'R-square_help'!B45)","v":46}]
[57,{"$f":"IF($G$6=\"Ingen\", 'R-square_help'!A46,Regressionssimulator!A49*'R-square_help'!C46+'R-square_help'!B46)","v":97}]
[46,{"$f":"IF($G$6=\"Ingen\", 'R-square_help'!A47,Regressionssimulator!A50*'R-square_help'!C47+'R-square_help'!B47)","v":11}]
[68,{"$f":"IF($G$6=\"Ingen\", 'R-square_help'!A48,Regressionssimulator!A51*'R-square_help'!C48+'R-square_help'!B48)","v":77}]
[19,{"$f":"IF($G$6=\"Ingen\", 'R-square_help'!A49,Regressionssimulator!A52*'R-square_help'!C49+'R-square_help'!B49)","v":98}]
[64,{"$f":"IF($G$6=\"Ingen\", 'R-square_help'!A50,Regressionssimulator!A53*'R-square_help'!C50+'R-square_help'!B50)","v":22}]
[70,{"$f":"IF($G$6=\"Ingen\", 'R-square_help'!A51,Regressionssimulator!A54*'R-square_help'!C51+'R-square_help'!B51)","v":40}]
[9,{"$f":"IF($G$6=\"Ingen\", 'R-square_help'!A52,Regressionssimulator!A55*'R-square_help'!C52+'R-square_help'!B52)","v":90}]
[58,{"$f":"IF($G$6=\"Ingen\", 'R-square_help'!A53,Regressionssimulator!A56*'R-square_help'!C53+'R-square_help'!B53)","v":83}]
[63,{"$f":"IF($G$6=\"Ingen\", 'R-square_help'!A54,Regressionssimulator!A57*'R-square_help'!C54+'R-square_help'!B54)","v":86}]
[12,{"$f":"IF($G$6=\"Ingen\", 'R-square_help'!A55,Regressionssimulator!A58*'R-square_help'!C55+'R-square_help'!B55)","v":11}]
[96,{"$f":"IF($G$6=\"Ingen\", 'R-square_help'!A56,Regressionssimulator!A59*'R-square_help'!C56+'R-square_help'!B56)","v":34}]
[86,{"$f":"IF($G$6=\"Ingen\", 'R-square_help'!A57,Regressionssimulator!A60*'R-square_help'!C57+'R-square_help'!B57)","v":93}]
[96,{"$f":"IF($G$6=\"Ingen\", 'R-square_help'!A58,Regressionssimulator!A61*'R-square_help'!C58+'R-square_help'!B58)","v":37}]
[90,{"$f":"IF($G$6=\"Ingen\", 'R-square_help'!A59,Regressionssimulator!A62*'R-square_help'!C59+'R-square_help'!B59)","v":68}]
[79,{"$f":"IF($G$6=\"Ingen\", 'R-square_help'!A60,Regressionssimulator!A63*'R-square_help'!C60+'R-square_help'!B60)","v":0}]
[78,{"$f":"IF($G$6=\"Ingen\", 'R-square_help'!A61,Regressionssimulator!A64*'R-square_help'!C61+'R-square_help'!B61)","v":83}]
[63,{"$f":"IF($G$6=\"Ingen\", 'R-square_help'!A62,Regressionssimulator!A65*'R-square_help'!C62+'R-square_help'!B62)","v":43}]
[51,{"$f":"IF($G$6=\"Ingen\", 'R-square_help'!A63,Regressionssimulator!A66*'R-square_help'!C63+'R-square_help'!B63)","v":1}]
[44,{"$f":"IF($G$6=\"Ingen\", 'R-square_help'!A64,Regressionssimulator!A67*'R-square_help'!C64+'R-square_help'!B64)","v":69}]
[48,{"$f":"IF($G$6=\"Ingen\", 'R-square_help'!A65,Regressionssimulator!A68*'R-square_help'!C65+'R-square_help'!B65)","v":76}]
[52,{"$f":"IF($G$6=\"Ingen\", 'R-square_help'!A66,Regressionssimulator!A69*'R-square_help'!C66+'R-square_help'!B66)","v":91}]
[{"$f":"RANDBETWEEN(0,100)","v":89},{"$f":"IF($G$6=\"Ingen\", 'R-square_help'!A67,Regressionssimulator!A70*'R-square_help'!C67+'R-square_help'!B67)","v":18}]
[86,{"$f":"IF($G$6=\"Ingen\", 'R-square_help'!A68,Regressionssimulator!A71*'R-square_help'!C68+'R-square_help'!B68)","v":9}]
[94,{"$f":"IF($G$6=\"Ingen\", 'R-square_help'!A69,Regressionssimulator!A72*'R-square_help'!C69+'R-square_help'!B69)","v":67}]
[20,{"$f":"IF($G$6=\"Ingen\", 'R-square_help'!A70,Regressionssimulator!A73*'R-square_help'!C70+'R-square_help'!B70)","v":89}]
[79,{"$f":"IF($G$6=\"Ingen\", 'R-square_help'!A71,Regressionssimulator!A74*'R-square_help'!C71+'R-square_help'!B71)","v":38}]
[59,{"$f":"IF($G$6=\"Ingen\", 'R-square_help'!A72,Regressionssimulator!A75*'R-square_help'!C72+'R-square_help'!B72)","v":88}]
[42,{"$f":"IF($G$6=\"Ingen\", 'R-square_help'!A73,Regressionssimulator!A76*'R-square_help'!C73+'R-square_help'!B73)","v":30}]
[58,{"$f":"IF($G$6=\"Ingen\", 'R-square_help'!A74,Regressionssimulator!A77*'R-square_help'!C74+'R-square_help'!B74)","v":67}]
[59,{"$f":"IF($G$6=\"Ingen\", 'R-square_help'!A75,Regressionssimulator!A78*'R-square_help'!C75+'R-square_help'!B75)","v":36}]
[99,{"$f":"IF($G$6=\"Ingen\", 'R-square_help'!A76,Regressionssimulator!A79*'R-square_help'!C76+'R-square_help'!B76)","v":66}]
[95,{"$f":"IF($G$6=\"Ingen\", 'R-square_help'!A77,Regressionssimulator!A80*'R-square_help'!C77+'R-square_help'!B77)","v":71}]
[27,{"$f":"IF($G$6=\"Ingen\", 'R-square_help'!A78,Regressionssimulator!A81*'R-square_help'!C78+'R-square_help'!B78)","v":96}]
[12,{"$f":"IF($G$6=\"Ingen\", 'R-square_help'!A79,Regressionssimulator!A82*'R-square_help'!C79+'R-square_help'!B79)","v":82}]
[76,{"$f":"IF($G$6=\"Ingen\", 'R-square_help'!A80,Regressionssimulator!A83*'R-square_help'!C80+'R-square_help'!B80)","v":33}]
[69,{"$f":"IF($G$6=\"Ingen\", 'R-square_help'!A81,Regressionssimulator!A84*'R-square_help'!C81+'R-square_help'!B81)","v":77}]
[46,{"$f":"IF($G$6=\"Ingen\", 'R-square_help'!A82,Regressionssimulator!A85*'R-square_help'!C82+'R-square_help'!B82)","v":96}]
[1,{"$f":"IF($G$6=\"Ingen\", 'R-square_help'!A83,Regressionssimulator!A86*'R-square_help'!C83+'R-square_help'!B83)","v":7}]
[34,{"$f":"IF($G$6=\"Ingen\", 'R-square_help'!A84,Regressionssimulator!A87*'R-square_help'!C84+'R-square_help'!B84)","v":85}]
[19,{"$f":"IF($G$6=\"Ingen\", 'R-square_help'!A85,Regressionssimulator!A88*'R-square_help'!C85+'R-square_help'!B85)","v":7}]
[2,{"$f":"IF($G$6=\"Ingen\", 'R-square_help'!A86,Regressionssimulator!A89*'R-square_help'!C86+'R-square_help'!B86)","v":74}]
[66,{"$f":"IF($G$6=\"Ingen\", 'R-square_help'!A87,Regressionssimulator!A90*'R-square_help'!C87+'R-square_help'!B87)","v":70}]
[45,{"$f":"IF($G$6=\"Ingen\", 'R-square_help'!A88,Regressionssimulator!A91*'R-square_help'!C88+'R-square_help'!B88)","v":69}]
[40,{"$f":"IF($G$6=\"Ingen\", 'R-square_help'!A89,Regressionssimulator!A92*'R-square_help'!C89+'R-square_help'!B89)","v":97}]
[70,{"$f":"IF($G$6=\"Ingen\", 'R-square_help'!A90,Regressionssimulator!A93*'R-square_help'!C90+'R-square_help'!B90)","v":2}]
[18,{"$f":"IF($G$6=\"Ingen\", 'R-square_help'!A91,Regressionssimulator!A94*'R-square_help'!C91+'R-square_help'!B91)","v":90}]
[43,{"$f":"IF($G$6=\"Ingen\", 'R-square_help'!A92,Regressionssimulator!A95*'R-square_help'!C92+'R-square_help'!B92)","v":33}]
[51,{"$f":"IF($G$6=\"Ingen\", 'R-square_help'!A93,Regressionssimulator!A96*'R-square_help'!C93+'R-square_help'!B93)","v":4}]
[48,{"$f":"IF($G$6=\"Ingen\", 'R-square_help'!A94,Regressionssimulator!A97*'R-square_help'!C94+'R-square_help'!B94)","v":33}]
[21,{"$f":"IF($G$6=\"Ingen\", 'R-square_help'!A95,Regressionssimulator!A98*'R-square_help'!C95+'R-square_help'!B95)","v":100}]
[93,{"$f":"IF($G$6=\"Ingen\", 'R-square_help'!A96,Regressionssimulator!A99*'R-square_help'!C96+'R-square_help'!B96)","v":79}]
[61,{"$f":"IF($G$6=\"Ingen\", 'R-square_help'!A97,Regressionssimulator!A100*'R-square_help'!C97+'R-square_help'!B97)","v":60}]
[19,{"$f":"IF($G$6=\"Ingen\", 'R-square_help'!A98,Regressionssimulator!A101*'R-square_help'!C98+'R-square_help'!B98)","v":17}]
[45,{"$f":"IF($G$6=\"Ingen\", 'R-square_help'!A99,Regressionssimulator!A102*'R-square_help'!C99+'R-square_help'!B99)","v":15}]
[58,{"$f":"IF($G$6=\"Ingen\", 'R-square_help'!A100,Regressionssimulator!A103*'R-square_help'!C100+'R-square_help'!B100)","v":12}]
[4,{"$f":"IF($G$6=\"Ingen\", 'R-square_help'!A101,Regressionssimulator!A104*'R-square_help'!C101+'R-square_help'!B101)","v":20}]

{"sheet":"R-square_help","index":17,"n_rows":101,"n_cols":7,"rows_kept":101,"cut":false,"hidden":true,"merged":[]}
["Random","Skæring","Hældning",null,null,"Skæring","Hældning"]
[{"$f":"RANDBETWEEN(0,100)","v":82},{"$f":"RANDBETWEEN($F$2,$F$3)","v":{"$error":"#N/A"}},{"$f":"RANDBETWEEN($G$2,$G$3)/100","v":0.93},null,null,{"$f":"VLOOKUP(Regressionssimulator!$G$6,'R-square_help'!$F$8:$G$11,2,FALSE)","v":{"$error":"#N/A"}},{"$f":"IF(Regressionssimulator!$G$6=\"Perfekt\",100,90)","v":90}]
[{"$f":"RANDBETWEEN(0,100)","v":97},{"$f":"RANDBETWEEN($F$2,$F$3)","v":{"$error":"#N/A"}},{"$f":"RANDBETWEEN($G$2,$G$3)/100","v":0.94},null,null,100,100]
[4,{"$error":"#N/A"},0.9]
[67,{"$error":"#N/A"},0.91]
[73,{"$error":"#N/A"},1]
[14,{"$error":"#N/A"},0.96,null,null,"Ingen",0]
[96,{"$error":"#N/A"},0.95,null,null,"Svag",-40]
[21,{"$error":"#N/A"},0.97,null,null,"Moderat",50]
[45,{"$error":"#N/A"},0.97,null,null,"Stærk",90]
[63,{"$error":"#N/A"},0.98,null,null,"Perfekt",100]
[8,{"$error":"#N/A"},1]
[43,{"$error":"#N/A"},0.98]
[95,{"$error":"#N/A"},0.98]
[78,{"$error":"#N/A"},1]
[94,{"$error":"#N/A"},0.91]
[44,{"$error":"#N/A"},0.91]
[51,{"$error":"#N/A"},0.91]
[39,{"$error":"#N/A"},0.91]
[11,{"$error":"#N/A"},1]
[62,{"$error":"#N/A"},0.94]
[0,{"$error":"#N/A"},0.98]
[74,{"$error":"#N/A"},1]
[18,{"$error":"#N/A"},0.97]
[29,{"$error":"#N/A"},0.99]
[16,{"$error":"#N/A"},0.9]
[30,{"$error":"#N/A"},0.95]
[78,{"$error":"#N/A"},1]
[52,{"$error":"#N/A"},0.93]
[92,{"$error":"#N/A"},0.97]
[76,{"$error":"#N/A"},0.96]
[43,{"$error":"#N/A"},0.92]
[48,{"$error":"#N/A"},0.91]
[49,{"$error":"#N/A"},1]
[97,{"$error":"#N/A"},0.98]
[70,{"$error":"#N/A"},0.91]
[7,{"$error":"#N/A"},0.96]
[81,{"$error":"#N/A"},0.97]
[1,{"$error":"#N/A"},0.98]
[85,{"$error":"#N/A"},0.97]
[61,{"$error":"#N/A"},0.94]
[91,{"$error":"#N/A"},1]
[80,{"$error":"#N/A"},0.99]
[24,{"$error":"#N/A"},0.93]
[46,{"$error":"#N/A"},0.93]
[97,{"$error":"#N/A"},0.98]
[11,{"$error":"#N/A"},0.92]
[77,{"$error":"#N/A"},0.98]
[98,{"$error":"#N/A"},0.99]
[22,{"$error":"#N/A"},0.98]
[40,{"$error":"#N/A"},0.98]
[90,{"$error":"#N/A"},0.92]
[83,{"$error":"#N/A"},0.95]
[86,{"$error":"#N/A"},0.9]
[11,{"$error":"#N/A"},0.93]
[34,{"$error":"#N/A"},0.95]
[93,{"$error":"#N/A"},0.96]
[37,{"$error":"#N/A"},0.94]
[68,{"$error":"#N/A"},0.96]
[0,{"$error":"#N/A"},0.96]
[83,{"$error":"#N/A"},0.9]
[43,{"$error":"#N/A"},1]
[1,{"$error":"#N/A"},0.96]
[69,{"$error":"#N/A"},0.96]
[76,{"$error":"#N/A"},0.9]
[91,{"$error":"#N/A"},0.97]
[{"$f":"RANDBETWEEN(0,100)","v":18},{"$f":"RANDBETWEEN($F$2,$F$3)","v":{"$error":"#N/A"}},{"$f":"RANDBETWEEN($G$2,$G$3)/100","v":0.91}]
[9,{"$error":"#N/A"},0.95]
[67,{"$error":"#N/A"},0.92]
[89,{"$error":"#N/A"},0.99]
[38,{"$error":"#N/A"},0.92]
[88,{"$error":"#N/A"},0.94]
[30,{"$error":"#N/A"},0.96]
[67,{"$error":"#N/A"},0.98]
[36,{"$error":"#N/A"},0.97]
[66,{"$error":"#N/A"},1]
[71,{"$error":"#N/A"},0.99]
[96,{"$error":"#N/A"},0.93]
[82,{"$error":"#N/A"},0.9]
[33,{"$error":"#N/A"},0.97]
[77,{"$error":"#N/A"},0.99]
[96,{"$error":"#N/A"},1]
[7,{"$error":"#N/A"},0.96]
[85,{"$error":"#N/A"},0.94]
[7,{"$error":"#N/A"},0.99]
[74,{"$error":"#N/A"},0.99]
[70,{"$error":"#N/A"},0.94]
[69,{"$error":"#N/A"},0.92]
[97,{"$error":"#N/A"},0.97]
[2,{"$error":"#N/A"},0.96]
[90,{"$error":"#N/A"},0.91]
[33,{"$error":"#N/A"},0.95]
[4,{"$error":"#N/A"},0.96]
[33,{"$error":"#N/A"},0.99]
[100,{"$error":"#N/A"},0.94]
[79,{"$error":"#N/A"},0.93]
[60,{"$error":"#N/A"},0.97]
[17,{"$error":"#N/A"},0.9]
[15,{"$error":"#N/A"},0.97]
[12,{"$error":"#N/A"},0.97]
[20,{"$error":"#N/A"},1]